{"text_format":"1","workbook":"xlsx","n_sheets":3,"sheets":["3 x 4","1 x 40","1 x 200"],"not_rendered":{"charts":0,"images":0,"macros":1,"external_links":0,"defined_names":0,"comments":0,"pivot_tables":0},"unopened":[],"bounds":{"document_bytes":16777216,"sheet_cells":100000,"rows_first":2000,"rows_last":500,"rows_between":2000,"halvings":0,"cell_chars":16384,"cell_head_chars":4096},"cells_cut":0,"cells_raw":0,"read":"whole","date_system":"1900"}

{"sheet":"3 x 4","index":0,"n_rows":76,"n_cols":42,"rows_kept":76,"cut":false,"hidden":false,"merged":[[36,16,36,17],[73,7,73,14],[74,7,74,14],[75,7,75,14],[43,6,44,14],[52,6,53,14],[59,6,60,14],[65,6,66,14],[71,6,71,14],[72,7,72,14],[3,34,3,37],[3,38,3,41],[37,22,37,24],[10,1,10,2],[10,16,10,17],[10,29,10,33],[11,22,11,24],[11,30,11,32],[4,7,4,8],[4,12,4,14],[4,22,4,24],[4,30,4,32],[17,1,17,2],[17,16,17,17],[18,22,18,24],[36,1,36,2],[3,29,3,33],[0,0,0,1],[1,0,1,1],[1,6,1,14],[3,1,3,2],[3,16,3,17]]}
["Version 2.1"]
["2025-05-13",null,null,null,null,null,"Spielplan  3 x 4"]
[]
[null,"Gruppe A",null,null,null,null,null,null,null,null,null,null,null,null,null,null,"Tabelle Gruppe A",null,null,null,null,null,null,null,null,null,null,null,null,"Direktvergleiche",null,null,null,null,"Hinspiele",null,null,null,"Rückspiele"]
[null,"Nr","Team","Tie Break","Strafpkt.",null,"Nr","Paarung",null,null,null,null,"Ergebnis",null,null,null,"Rang","Team","Sp","G","U","V","Tore",null,null,"Diff","Pkt",null,null,"Pkt","Tore",null,null,"Diff",{"$f":"LEFT($R$6,6)","v":"FC Bar"},{"$f":"LEFT($R$7,6)","v":"Eintra"},{"$f":"LEFT($R$8,6)","v":"Maibac"},{"$f":"LEFT($R$9,6)","v":"1.FC R"},{"$f":"LEFT($R$6,6)","v":"FC Bar"},{"$f":"LEFT($R$7,6)","v":"Eintra"},{"$f":"LEFT($R$8,6)","v":"Maibac"},{"$f":"LEFT($R$9,6)","v":"1.FC R"}]
[null,"A1","1.FC Riedwald",null,null,null,1,"A1","A4",{"$f":"IFERROR(VLOOKUP($H6,$B$6:$C$36,2,0),\"\")","v":"1.FC Riedwald"},"-",{"$f":"IFERROR(VLOOKUP($I6,$B$6:$C$36,2,0),\"\")","v":"Maibach 1822 eV"},2,":",1,null,{"$f":"Gruppentabelle(0,3,$J$6:$J$41,$L$6:$L$41,$M$6:$M$41,$O$6:$O$41,$C$6:$C$9,$D$6:$D$9,$E$6:$E$9)","v":1},"FC Barcelona",3,2,0,1,9,":",6,3,6,"","FC Barcelona","","","","","","","1 : 2","5 : 2","3 : 2","","","",""]
[null,"A2","Eintracht Frankfurt",null,null,null,2,"B1","B4","SSV Wildbach","-","FC Grönlingen",1,":",0,null,2,"Eintracht Frankfurt",3,2,0,1,6,":",5,1,6,"","Eintracht Frankfurt","","","","","","2 : 1","","2 : 3","2 : 1","","","",""]
[null,"A3","FC Barcelona",null,null,null,3,"C1","C4","Kickers Offenbach","-","HSV",1,":",2,null,3,"Maibach 1822 eV",4,2,0,2,8,":",9,-1,6,"","Maibach 1822 eV","","","","","","2 : 5","3 : 2","","1 : 2","","","","2 : 0"]
[null,"A4","Maibach 1822 eV",null,null,null,4,"A3","A2","FC Barcelona","-","Eintracht Frankfurt",1,":",2,null,4,"1.FC Riedwald",4,1,0,3,5,":",8,-3,3,"","1.FC Riedwald","","","","","","2 : 3","1 : 2","2 : 1","","","","0 : 2",""]
[null,null,null,null,null,null,5,"B3","B2","Arsenal London","-","Manchester City",2,":",1]
[null,"Gruppe B",null,null,null,null,6,"C3","C2","Borussia Dortmund","-","SSV Wildeck",1,":",2,null,"Tabelle Gruppe B",null,null,null,null,null,null,null,null,null,null,null,null,"Direktvergleiche"]
[null,"Nr","Team","Tie Break","Strafpkt.",null,7,"A3","A1","FC Barcelona","-","1.FC Riedwald",3,":",2,null,"Rang","Team","Sp","G","U","V","Tore",null,null,"Diff","Pkt",null,null,"Pkt","Tore",null,null,"Diff"]
[null,"B1","SSV Wildbach",null,null,null,8,"B3","B1","Arsenal London","-","SSV Wildbach",2,":",1,null,{"$f":"Gruppentabelle(0,3,$J$6:$J$41,$L$6:$L$41,$M$6:$M$41,$O$6:$O$41,$C$13:$C$16,$D$13:$D$16,$E$13:$E$16)","v":1},"Arsenal London",3,3,0,0,7,":",2,5,9,"","Arsenal London","","","","",""]
[null,"B2","Manchester City",null,null,null,9,"C3","C1","Borussia Dortmund","-","Kickers Offenbach",2,":",1,null,2,"Manchester City",3,1,0,2,2,":",3,-1,3,"","Manchester City",3,1,":",0,1]
[null,"B3","Arsenal London",null,null,null,10,"A2","A4","Eintracht Frankfurt","-","Maibach 1822 eV",2,":",3,null,3,"SSV Wildbach",3,1,0,2,2,":",3,-1,3,"","SSV Wildbach",0,0,":",1,-1]
[null,"B4","FC Grönlingen",null,null,null,11,"B2","B4","Manchester City","-","FC Grönlingen",0,":",1,null,4,"FC Grönlingen",3,1,0,2,1,":",4,-3,3,"","FC Grönlingen","","","","",""]
[null,null,null,null,null,null,12,"C2","C4","SSV Wildeck","-","HSV",1,":",1]
[null,"Gruppe C",null,null,null,null,13,"A1","A2","1.FC Riedwald","-","Eintracht Frankfurt",1,":",2,null,"Tabelle Gruppe C"]
[null,"Nr","Team","Tie Break","Strafpkt.",null,14,"B1","B2","SSV Wildbach","-","Manchester City",0,":",1,null,"Rang","Team","Sp","G","U","V","Tore",null,null,"Diff","Pkt"]
[null,"C1","Kickers Offenbach",null,null,null,15,"C1","C2","Kickers Offenbach","-","SSV Wildeck",2,":",1,null,{"$f":"Gruppentabelle(0,3,$J$6:$J$41,$L$6:$L$41,$M$6:$M$41,$O$6:$O$41,$C$20:$C$23,$D$20:$D$23,$E$20:$E$23)","v":1},"Borussia Dortmund",3,2,0,1,6,":",5,1,6]
[null,"C2","SSV Wildeck",null,null,null,16,"A4","A3","Maibach 1822 eV","-","FC Barcelona",2,":",5,null,2,"HSV",3,1,1,1,5,":",5,0,4]
[null,"C3","Borussia Dortmund",null,null,null,17,"B4","B3","FC Grönlingen","-","Arsenal London",0,":",3,null,3,"SSV Wildeck",3,1,1,1,4,":",4,0,4]
[null,"C4","HSV",null,null,null,18,"C4","C3","HSV","-","Borussia Dortmund",2,":",3,null,4,"Kickers Offenbach",3,1,0,2,4,":",5,-1,3]
[null,null,null,null,null,null,19,"A4","A1","Maibach 1822 eV","-","1.FC Riedwald",2,":",0]
[null,null,null,null,null,null,20,"B4","B1","FC Grönlingen","-","SSV Wildbach",null,":"]
[null,null,null,null,null,null,21,"C4","C1","HSV","-","Kickers Offenbach",null,":"]
[null,null,null,null,null,null,22,"A2","A3","Eintracht Frankfurt","-","FC Barcelona",null,":"]
[null,null,null,null,null,null,23,"B2","B3","Manchester City","-","Arsenal London",null,":"]
[null,null,null,null,null,null,24,"C2","C3","SSV Wildeck","-","Borussia Dortmund",null,":"]
[null,null,null,null,null,null,25,"A1","A3","1.FC Riedwald","-","FC Barcelona",null,":"]
[null,null,null,null,null,null,26,"B1","B3","SSV Wildbach","-","Arsenal London",null,":"]
[null,null,null,null,null,null,27,"C1","C3","Kickers Offenbach","-","Borussia Dortmund",null,":"]
[null,null,null,null,null,null,28,"A4","A2","Maibach 1822 eV","-","Eintracht Frankfurt",null,":"]
[null,null,null,null,null,null,29,"B4","B2","FC Grönlingen","-","Manchester City",null,":"]
[null,null,null,null,null,null,30,"C4","C2","HSV","-","SSV Wildeck",null,":",null,null,"Tabelle zur Bestimmung der beiden besten Gruppendritten:"]
[null,null,null,null,null,null,31,"A2","A1","Eintracht Frankfurt","-","1.FC Riedwald",null,":"]
[null,"Gruppendritte",null,null,null,null,32,"B2","B1","Manchester City","-","SSV Wildbach",null,":",null,null,"Tabelle Gruppendritte"]
[null,"Nr","Team","Tie Break","Strafpkt.",null,33,"C2","C1","SSV Wildeck","-","Kickers Offenbach",null,":",null,null,"Rang","Team","Sp","G","U","V","Tore",null,null,"Diff","Pkt"]
[null,"A3",{"$f":"R8","v":"Maibach 1822 eV"},null,null,null,34,"A3","A4","FC Barcelona","-","Maibach 1822 eV",null,":",null,null,{"$f":"Gruppentabelle(0,3,$J$6:$J$41,$L$6:$L$41,$M$6:$M$41,$O$6:$O$41,$C$39:$C$41,$D$39:$D$41,$E$39:$E$41)","v":1},"Maibach 1822 eV",4,2,0,2,8,":",9,-1,6]
[null,"B3",{"$f":"R15","v":"SSV Wildbach"},null,null,null,35,"B3","B4","Arsenal London","-","FC Grönlingen",null,":",null,null,2,"SSV Wildeck",3,1,1,1,4,":",4,0,4]
[null,"C3",{"$f":"R22","v":"SSV Wildeck"},null,null,null,36,"C3","C4","Borussia Dortmund","-","HSV",null,":",null,null,3,"SSV Wildbach",3,1,0,2,2,":",3,-1,3]
[]
[]
[null,null,null,null,null,null,"Viertelfinale"]
[]
[]
[null,null,null,null,null,null,37,"1A","3-1",{"$f":"R6","v":"FC Barcelona"},"-",{"$f":"R39","v":"Maibach 1822 eV"},2,":",1]
[null,null,null,null,null,null,38,"1B","3-2",{"$f":"R13","v":"Arsenal London"},"-",{"$f":"R40","v":"SSV Wildeck"},1,":",3]
[null,null,null,null,null,null,39,"1C","2A",{"$f":"R20","v":"Borussia Dortmund"},"-",{"$f":"R7","v":"Eintracht Frankfurt"},2,":",3]
[null,null,null,null,null,null,40,"2B","2C",{"$f":"R14","v":"Manchester City"},"-",{"$f":"R21","v":"HSV"},4,":",0]
[]
[]
[null,null,null,null,null,null,"Halbfinale"]
[]
[]
[null,null,null,null,null,null,41,"W37","W38",{"$f":"IF(OR(M47=\"\",O47=\"\",M47=O47),\"\",IF(M47>O47,J47,L47))","v":"FC Barcelona"},"-",{"$f":"IF(OR(M48=\"\",O48=\"\",M48=O48),\"\",IF(M48>O48,J48,L48))","v":"SSV Wildeck"},2,":",4]
[null,null,null,null,null,null,42,"W39","W40",{"$f":"IF(OR(M49=\"\",O49=\"\",M49=O49),\"\",IF(M49>O49,J49,L49))","v":"Eintracht Frankfurt"},"-",{"$f":"IF(OR(M50=\"\",O50=\"\",M50=O50),\"\",IF(M50>O50,J50,L50))","v":"Manchester City"},1,":",2]
[]
[]
[null,null,null,null,null,null,"3. Platz"]
[]
[]
[null,null,null,null,null,null,43,"L41","L42",{"$f":"IF(OR(M56=\"\",O56=\"\",M56=O56),\"\",IF(M56<O56,J56,L56))","v":"FC Barcelona"},"-",{"$f":"IF(OR(M57=\"\",O57=\"\",M57=O57),\"\",IF(M57<O57,J57,L57))","v":"Eintracht Frankfurt"},1,":",0]
[]
[]
[null,null,null,null,null,null,"Finale"]
[]
[]
[null,null,null,null,null,null,44,"W41","W42",{"$f":"IF(OR(M56=\"\",O56=\"\",M56=O56),\"\",IF(M56>O56,J56,L56))","v":"SSV Wildeck"},"-",{"$f":"IF(OR(M57=\"\",O57=\"\",M57=O57),\"\",IF(M57>O57,J57,L57))","v":"Manchester City"},2,":",3]
[]
[]
[null,null,null,null,null,null,"Endtabelle"]
[null,null,null,null,null,null,"1.",{"$f":"IF(OR(M69=\"\",O69=\"\",M69=O69),\"\",IF(M69>O69,J69,L69))","v":"Manchester City"}]
[null,null,null,null,null,null,"2.",{"$f":"IF(OR(M69=\"\",O69=\"\",M69=O69),\"\",IF(M69<O69,J69,L69))","v":"SSV Wildeck"}]
[null,null,null,null,null,null,"3.",{"$f":"IF(OR(M63=\"\",O63=\"\",M63=O63),\"\",IF(M63>O63,J63,L63))","v":"FC Barcelona"}]
[null,null,null,null,null,null,"4.",{"$f":"IF(OR(M63=\"\",O63=\"\",M63=O63),\"\",IF(M63<O63,J63,L63))","v":"Eintracht Frankfurt"}]

{"sheet":"1 x 40","index":1,"n_rows":1565,"n_cols":114,"rows_kept":1565,"cut":false,"hidden":false,"merged":[[0,0,0,1],[1,0,1,1],[3,16,3,17],[3,29,3,33],[3,1,3,2],[1,6,1,14],[2,9,2,11],[3,74,3,77],[3,34,3,37],[4,7,4,8],[4,12,4,14],[4,22,4,24],[4,30,4,32]]}
[]
[null,null,null,null,null,null,"Spielplan 1 x 40"]
[null,null,null,null,null,null,null,null,null,"(mit Rückspielen)"]
[null,"Gruppe A",null,null,null,null,null,null,null,null,null,null,null,null,null,null,"Tabelle Gruppe A",null,null,null,null,null,null,null,null,null,null,null,null,"Direktvergleiche",null,null,null,null,"Hinspiele",null,null,null,null,null,null,null,null,null,null,null,null,null,null,null,null,null,null,null,null,null,null,null,null,null,null,null,null,null,null,null,null,null,null,null,null,null,null,null,"Rückspiele"]
[null,"Nr","Team","Tie Break","Strafpkt.",null,"Nr","Paarung",null,null,null,null,"Ergebnis",null,null,null,"Rang","Team","Sp","G","U","V","Tore",null,null,"Diff","Pkt",null,null,"Pkt","Tore",null,null,"Diff",{"$f":"LEFT($R$6,6)","v":"FC Bas"},{"$f":"LEFT($R$7,6)","v":"Schach"},{"$f":"LEFT($R$8,6)","v":"Real M"},{"$f":"LEFT($R$9,6)","v":"Sporti"},{"$f":"LEFT($R$10,6)","v":"Atalan"},{"$f":"LEFT($R$11,6)","v":"FC Brü"},{"$f":"LEFT($R$12,6)","v":"FC Bar"},{"$f":"LEFT($R$13,6)","v":"FC Ars"},{"$f":"LEFT($R$14,6)","v":"Benfic"},{"$f":"LEFT($R$15,6)","v":"AC Mai"},{"$f":"LEFT($R$16,6)","v":"Roter "},{"$f":"LEFT($R$17,6)","v":"AC Rom"},{"$f":"LEFT($R$18,6)","v":"Red Bu"},{"$f":"LEFT($R$19,6)","v":"Stade "},{"$f":"LEFT($R$20,6)","v":"Celtic"},{"$f":"LEFT($R$21,6)","v":"Hertha"},{"$f":"LEFT($R$22,6)","v":"Dinamo"},{"$f":"LEFT($R$23,6)","v":"Bayer "},{"$f":"LEFT($R$24,6)","v":"FC Bol"},{"$f":"LEFT($R$25,6)","v":"Young "},{"$f":"LEFT($R$26,6)","v":"Sturm "},{"$f":"LEFT($R$27,6)","v":"Eintra"},{"$f":"LEFT($R$28,6)","v":"RB Lei"},{"$f":"LEFT($R$29,6)","v":"OSC Li"},{"$f":"LEFT($R$30,6)","v":"Mainz "},{"$f":"LEFT($R$31,6)","v":"Feyeno"},{"$f":"LEFT($R$32,6)","v":"PSV Ei"},{"$f":"LEFT($R$33,6)","v":"FC Bay"},{"$f":"LEFT($R$34,6)","v":"Inter "},{"$f":"LEFT($R$35,6)","v":"Manche"},{"$f":"LEFT($R$36,6)","v":"Juvent"},{"$f":"LEFT($R$37,6)","v":"Boruss"},{"$f":"LEFT($R$38,6)","v":"FC Lil"},{"$f":"LEFT($R$39,6)","v":"VfB St"},{"$f":"LEFT($R$40,6)","v":"AS Mon"},{"$f":"LEFT($R$41,6)","v":"Atleti"},{"$f":"LEFT($R$42,6)","v":"FC Liv"},{"$f":"LEFT($R$43,6)","v":"Paris "},{"$f":"LEFT($R$44,6)","v":"Aston "},{"$f":"LEFT($R$45,6)","v":"FC Gir"},{"$f":"AI5","v":"FC Bas"},{"$f":"AJ5","v":"Schach"},"Real M","Sporti","Atalan","FC Brü","FC Bar","FC Ars","Benfic","AC Mai","Roter ","AC Rom","Red Bu","Stade ","Celtic","Hertha","Dinamo","Bayer ","FC Bol","Young ","Sturm ","Eintra","RB Lei","OSC Li","Mainz ","Feyeno","PSV Ei","FC Bay","Inter ","Manche","Juvent","Boruss","FC Lil","VfB St","AS Mon","Atleti","FC Liv","Paris ","Aston ","FC Gir"]
[null,1,"Real Madrid",null,null,null,1,{"$f":"spielpaarungen(40,TRUE,TRUE)","v":3},31,{"$f":"IFERROR(VLOOKUP($H6,$B$6:$C$45,2,0),\"\")","v":"FC Bayern München"},"-",{"$f":"IFERROR(VLOOKUP($I6,$B$6:$C$45,2,0),\"\")","v":"FC Girona"},3,":",1,null,{"$f":"Gruppentabelle(0,3,$J$6:$J$1265,$L$6:$L$1265,$M$6:$M$1265,$O$6:$O$1265,$C$6:$C$45,$D$6:$D$45,$E$6:$E$45)","v":1},"FC Basel",40,23,7,10,98,":",42,56,76,"","FC Basel","","","","","","","0 : 2","3 : 0","1 : 5","2 : 0","9 : 2","0 : 0","0 : 3","0 : 0","5 : 1","0 : 3","4 : 0","0 : 1","1 : 2","2 : 0","0 : 0","4 : 0","1 : 3","1 : 3","3 : 1","5 : 2","9 : 2","3 : 0","0 : 0","0 : 0","2 : 5","0 : 0","3 : 0","3 : 1","3 : 0","1 : 3","5 : 1","3 : 0","0 : 0","2 : 0","3 : 0","3 : 0","1 : 0","9 : 2","4 : 0","","","","3 : 0","","","","","","","","","","","","","","","","","","","","","","","","","","","","","","","","","","","",""]
[null,2,"Manchester City",null,null,null,2,29,4,{"$f":"IFERROR(VLOOKUP($H7,$B$6:$C$45,2,0),\"\")","v":"Aston Villa"},"-",{"$f":"IFERROR(VLOOKUP($I7,$B$6:$C$45,2,0),\"\")","v":"Paris Saint-Germain"},0,":",3,null,2,"Schachtjor Donezk",40,22,5,13,83,":",70,13,71,"","Schachtjor Donezk","","","","","","2 : 0","","3 : 0","3 : 0","0 : 0","1 : 5","0 : 3","2 : 9","0 : 3","2 : 9","1 : 3","2 : 1","3 : 1","3 : 0","5 : 1","4 : 0","0 : 3","0 : 3","1 : 5","0 : 0","3 : 0","2 : 5","0 : 0","1 : 0","0 : 0","3 : 0","0 : 3","2 : 0","3 : 1","0 : 3","3 : 0","0 : 0","3 : 1","2 : 0","1 : 5","5 : 1","9 : 2","3 : 1","1 : 0","9 : 2","","","","","","","","","","","","","","","","","","","","","","","","","","","","","","","","","","1 : 0","","","","","",""]
[null,3,"FC Bayern München",null,null,null,3,8,25,"RB Leipzig","-","OSC Lille",5,":",2,null,3,"Real Madrid",40,21,5,14,81,":",53,28,68,"","Real Madrid","","","","","","0 : 3","0 : 3","","9 : 2","0 : 3","1 : 3","0 : 0","0 : 0","0 : 0","1 : 0","3 : 0","3 : 0","3 : 1","0 : 3","2 : 0","0 : 0","1 : 3","3 : 0","0 : 3","4 : 0","3 : 1","3 : 1","0 : 2","1 : 3","1 : 0","3 : 0","0 : 2","5 : 2","3 : 0","0 : 1","5 : 1","5 : 2","2 : 0","1 : 5","1 : 0","0 : 0","9 : 2","5 : 1","3 : 0","0 : 3","","","","","","","","","","","","1 : 3","","","","","","","","","","","","","","","","","","","","","","","","","","","",""]
[null,4,"Paris Saint-Germain",null,null,null,4,24,33,"Red Bull Salzburg","-","Sturm Graz",3,":",1,null,4,"Sporting Lissabon",40,20,7,13,88,":",65,23,67,"","Sporting Lissabon",3,3,":",1,2,"5 : 1","0 : 3","2 : 9","","3 : 1","2 : 5","2 : 9","0 : 1","1 : 3","0 : 0","3 : 1","0 : 3","3 : 0","3 : 1","0 : 3","0 : 0","1 : 0","5 : 1","4 : 0","9 : 2","0 : 0","3 : 1","3 : 0","5 : 2","0 : 3","3 : 0","5 : 1","2 : 0","0 : 0","0 : 0","0 : 0","9 : 2","1 : 3","3 : 0","3 : 0","3 : 0","4 : 0","1 : 5","0 : 2","0 : 0","0 : 3","","","","","","","","","","","","","","","","","","","","","","","","","","","","","","","","","","","","","","",""]
[null,5,"FC Liverpool",null,null,null,5,35,18,"Eintracht Frankfurt","-","AC Mailand",1,":",3,null,5,"Atalanta Bergamo",40,20,7,13,88,":",65,23,67,"","Atalanta Bergamo",0,1,":",3,-2,"0 : 2","0 : 0","3 : 0","1 : 3","","0 : 0","7 : 6","1 : 3","0 : 0","3 : 0","5 : 2","2 : 9","1 : 3","0 : 1","3 : 1","3 : 0","5 : 2","0 : 0","3 : 0","1 : 0","5 : 2","0 : 4","2 : 0","0 : 0","9 : 2","1 : 3","3 : 1","0 : 3","3 : 1","3 : 0","1 : 2","0 : 0","0 : 3","5 : 5","3 : 1","3 : 0","2 : 0","1 : 3","0 : 1","4 : 0","","","","","","","5 : 2","","","","","","","","","","","","","","","","","","","","","","","","","","","","","","","","",""]
[null,6,"Inter Mailand",null,null,null,6,17,32,"Schachtjor Donezk","-","VfB Stuttgart",2,":",0,null,6,"FC Brügge",40,20,7,13,80,":",68,12,67,"","FC Brügge","","","","","","2 : 9","5 : 1","3 : 1","5 : 2","0 : 0","","1 : 0","0 : 3","0 : 0","0 : 0","4 : 0","1 : 5","0 : 3","9 : 2","0 : 1","0 : 3","3 : 1","3 : 0","3 : 0","2 : 5","0 : 2","5 : 1","2 : 0","3 : 0","0 : 0","2 : 0","0 : 0","3 : 1","0 : 4","5 : 2","1 : 5","3 : 1","2 : 9","0 : 4","3 : 0","1 : 3","0 : 0","3 : 0","0 : 0","3 : 0","","","","","","","","","","","","","","","","","","","","","","","","","3 : 0","","","","","","","","","","","","","","",""]
[null,7,"Borussia Dortmund",null,null,null,7,36,16,"Mainz 05","-","FC Brügge",0,":",0,null,7,"FC Barcelona",40,20,6,14,96,":",62,34,66,"","FC Barcelona","","","","","","0 : 0","3 : 0","0 : 0","9 : 2","6 : 7","0 : 1","","1 : 3","1 : 5","1 : 3","1 : 3","3 : 1","1 : 3","0 : 3","4 : 0","5 : 2","3 : 1","0 : 0","0 : 4","3 : 0","3 : 0","1 : 0","1 : 3","5 : 2","1 : 3","3 : 1","9 : 2","5 : 1","2 : 0","0 : 0","0 : 0","3 : 0","3 : 0","5 : 1","4 : 0","4 : 0","1 : 2","3 : 1","0 : 3","0 : 0","","","","","2 : 5","","","","","","","","","","","","","","","","","","","","","","","","","","","","","","","","","","",""]
[null,8,"RB Leipzig",null,null,null,8,23,19,"Dinamo Zagreb","-","Feyenoord Rotterdam",3,":",0,null,8,"FC Arsenal",40,20,6,14,87,":",61,26,66,"","FC Arsenal","","","","","","3 : 0","9 : 2","0 : 0","1 : 0","3 : 1","3 : 0","3 : 1","","2 : 5","9 : 2","0 : 0","1 : 3","1 : 0","0 : 0","1 : 3","0 : 3","0 : 1","3 : 1","3 : 1","0 : 3","2 : 5","3 : 0","4 : 0","0 : 0","5 : 2","0 : 3","1 : 5","4 : 0","0 : 2","1 : 3","3 : 1","0 : 0","1 : 0","1 : 3","3 : 1","2 : 5","5 : 1","0 : 0","5 : 2","1 : 2","","","","","","","","","","","","","","4 : 0","","","","","","","","","","","","","","","","","","","","","","","","","",""]
[null,9,"FC Barcelona",null,null,null,9,34,15,"Stade Brest","-","FC Arsenal",0,":",0,null,9,"Benfica Lissabon",40,20,6,14,84,":",59,25,66,"","Benfica Lissabon","","","","","","0 : 0","3 : 0","0 : 0","3 : 1","0 : 0","0 : 0","5 : 1","5 : 2","","0 : 3","2 : 5","1 : 5","2 : 0","0 : 3","1 : 5","0 : 4","3 : 0","0 : 2","2 : 0","1 : 3","3 : 0","3 : 0","3 : 1","1 : 2","1 : 3","9 : 2","5 : 1","1 : 3","3 : 0","0 : 3","1 : 0","0 : 2","3 : 1","0 : 3","3 : 0","3 : 1","0 : 0","0 : 0","5 : 1","3 : 0","","","","","","","","","","","","","","","","9 : 2","","","","","","","","","","","","","","","","","","","","","","","",""]
[null,10,"Bayer Leverkusen",null,null,null,10,12,9,"Atalanta Bergamo","-","FC Barcelona",7,":",6,null,10,"AC Mailand",40,20,6,14,80,":",59,21,66,"","AC Mailand","","","","","","1 : 5","9 : 2","0 : 1","0 : 0","0 : 3","0 : 0","3 : 1","2 : 9","3 : 0","","2 : 0","3 : 1","3 : 0","0 : 1","1 : 3","9 : 2","0 : 3","1 : 3","5 : 1","0 : 0","3 : 1","3 : 1","1 : 0","0 : 0","3 : 1","5 : 1","3 : 0","2 : 5","2 : 0","0 : 0","3 : 0","0 : 4","0 : 1","3 : 0","2 : 0","0 : 3","4 : 0","0 : 3","1 : 3","3 : 1","","","","","","","","","","","","","","","","","","","","","","0 : 0","","","","","","","","","","","","","","","","","",""]
[null,11,"Atletico Madrid",null,null,null,11,37,1,"AC Roma","-","Real Madrid",0,":",3,null,11,"Roter Stern Belgrad",40,20,5,15,70,":",70,0,65,"","Roter Stern Belgrad","","","","","","3 : 0","3 : 1","0 : 3","1 : 3","2 : 5","0 : 4","3 : 1","0 : 0","5 : 2","0 : 2","","0 : 0","1 : 0","2 : 5","2 : 0","0 : 0","0 : 0","0 : 4","0 : 4","5 : 2","0 : 2","2 : 9","1 : 0","4 : 0","0 : 1","1 : 0","3 : 1","3 : 1","3 : 1","3 : 0","5 : 2","3 : 1","3 : 0","3 : 1","0 : 3","0 : 0","1 : 3","2 : 5","3 : 1","2 : 0","","","","","","","","","","","","","","","","","","","","","","","","","","","","","","","","1 : 3","","","","","","","",""]
[null,12,"Atalanta Bergamo",null,null,null,12,20,38,"Sporting Lissabon","-","FC Basel",5,":",1,null,12,"AC Roma",40,19,7,14,92,":",54,38,64,"","AC Roma","","","","","","0 : 4","1 : 2","0 : 3","3 : 0","9 : 2","5 : 1","1 : 3","3 : 1","5 : 1","1 : 3","0 : 0","","4 : 0","0 : 4","0 : 2","1 : 3","0 : 0","3 : 0","4 : 0","0 : 1","0 : 0","4 : 0","0 : 0","0 : 0","2 : 0","0 : 1","9 : 2","0 : 2","0 : 0","1 : 0","9 : 2","2 : 5","0 : 3","1 : 3","0 : 0","5 : 1","5 : 2","5 : 2","3 : 0","3 : 0","","","3 : 1","","","","","","","","","","","","","","","","","","","","","","","","","","","","","","","","","","","","",""]
[null,13,"Juventus Turin",null,null,null,13,14,40,"Benfica Lissabon","-","Hertha BSC",0,":",4,null,13,"Red Bull Salzburg",40,19,6,15,72,":",57,15,63,"","Red Bull Salzburg","","","","","","1 : 0","1 : 3","1 : 3","0 : 3","3 : 1","3 : 0","3 : 1","0 : 1","0 : 2","0 : 3","0 : 1","0 : 4","","2 : 0","3 : 1","2 : 0","3 : 0","9 : 2","1 : 3","2 : 5","3 : 1","0 : 0","3 : 0","1 : 3","4 : 0","0 : 0","0 : 0","0 : 3","2 : 5","3 : 1","5 : 2","3 : 0","1 : 0","2 : 5","3 : 1","0 : 0","0 : 1","0 : 0","5 : 2","0 : 0","","","","","","","","","","","","","","","","","","","","","3 : 0","","","","","","","","","","","","","","","","","","",""]
[null,14,"Benfica Lissabon",null,null,null,14,30,22,"FC Bologna","-","Celtic Glasgow",3,":",2,null,14,"Stade Brest",40,19,5,16,72,":",67,5,62,"","Stade Brest","","","","","","2 : 1","0 : 3","3 : 0","1 : 3","1 : 0","2 : 9","3 : 0","0 : 0","3 : 0","1 : 0","5 : 2","4 : 0","0 : 2","","0 : 3","1 : 5","1 : 3","0 : 0","0 : 0","1 : 3","0 : 3","0 : 0","2 : 5","9 : 2","3 : 0","0 : 2","0 : 3","2 : 1","5 : 2","3 : 1","0 : 1","3 : 1","1 : 3","3 : 0","5 : 1","1 : 3","3 : 0","1 : 0","3 : 1","0 : 0","","","","","","","","0 : 4","","","","","","","","","","","","","","","","","","","","","","","","","","","","","","","",""]
[null,15,"FC Arsenal",null,null,null,15,26,7,"Roter Stern Belgrad","-","Borussia Dortmund",3,":",1,null,15,"Celtic Glasgow",40,19,5,16,73,":",69,4,62,"","Celtic Glasgow","","","","","","0 : 2","1 : 5","0 : 2","3 : 0","1 : 3","1 : 0","0 : 4","3 : 1","5 : 1","3 : 1","0 : 2","2 : 0","1 : 3","3 : 0","","2 : 5","0 : 3","4 : 0","2 : 3","1 : 3","0 : 0","0 : 0","3 : 1","3 : 0","3 : 0","0 : 0","2 : 5","0 : 4","0 : 0","0 : 0","1 : 0","3 : 1","2 : 9","0 : 3","1 : 0","9 : 2","3 : 1","3 : 1","5 : 1","2 : 0","","","","","","","","","","","","","","","","","","","1 : 3","","","","","","","","","","","","","","","","","","","","",""]
[null,16,"FC Brügge",null,null,null,16,6,27,"Inter Mailand","-","Young Boys Bern",0,":",3,null,16,"Hertha BSC",40,18,7,15,80,":",76,4,61,"","Hertha BSC","","","","","","0 : 0","0 : 4","0 : 0","0 : 0","0 : 3","3 : 0","2 : 5","3 : 0","4 : 0","2 : 9","0 : 0","3 : 1","0 : 2","5 : 1","5 : 2","","0 : 0","1 : 2","1 : 3","3 : 1","1 : 0","0 : 3","0 : 4","5 : 1","9 : 2","0 : 1","3 : 0","1 : 5","0 : 0","1 : 3","3 : 0","3 : 0","4 : 0","2 : 9","3 : 1","5 : 2","0 : 3","2 : 0","4 : 0","0 : 0","","","","","","","","","2 : 9","","","","","","","","","","","","","","","","","","","","","","","","","","","","","","",""]
[null,17,"Schachtjor Donezk",null,null,null,17,10,28,"Bayer Leverkusen","-","AS Monaco",9,":",2,null,17,"Dinamo Zagreb",40,18,6,16,75,":",70,5,60,"","Dinamo Zagreb","","","","","","0 : 4","3 : 0","3 : 1","0 : 1","2 : 5","1 : 3","1 : 3","1 : 0","0 : 3","3 : 0","0 : 0","0 : 0","0 : 3","3 : 1","3 : 0","0 : 0","","0 : 4","2 : 9","5 : 2","0 : 0","1 : 3","3 : 1","1 : 3","1 : 5","3 : 0","0 : 0","0 : 0","1 : 0","3 : 1","4 : 0","2 : 5","0 : 2","4 : 0","1 : 3","2 : 0","0 : 4","5 : 1","9 : 2","3 : 0","","","","","","","","","","","","","","","","","","","","","","","","","","5 : 1","","","","","","","","","","","","","",""]
[null,18,"AC Mailand",null,null,null,18,11,21,"Atletico Madrid","-","PSV Eindhoven",2,":",1,null,18,"Bayer Leverkusen",39,18,4,17,81,":",73,8,58,"","Bayer Leverkusen","","","","","","3 : 1","3 : 0","0 : 3","1 : 5","0 : 0","0 : 3","0 : 0","1 : 3","2 : 0","3 : 1","4 : 0","0 : 3","2 : 9","0 : 0","0 : 4","2 : 1","4 : 0","","9 : 2","1 : 3","0 : 4","1 : 5","3 : 1","3 : 0","3 : 0","5 : 2","4 : 0","0 : 2","0 : 3","0 : 2","0 : 0","3 : 0","5 : 1","3 : 0","9 : 2","0 : 3","0 : 1","1 : 3","1 : 5","5 : 1","","","","","","","","","","","","","","","","","","","","","","","","","","","","","","","","","","","","","","","",""]
[null,19,"Feyenoord Rotterdam",null,null,null,19,39,5,"FC Lille","-","FC Liverpool",1,":",3,null,19,"FC Bologna",40,17,6,17,80,":",77,3,57,"","FC Bologna","","","","","","3 : 1","5 : 1","3 : 0","0 : 4","0 : 3","0 : 3","4 : 0","1 : 3","0 : 2","1 : 5","4 : 0","0 : 4","3 : 1","0 : 0","3 : 2","3 : 1","9 : 2","2 : 9","","0 : 1","2 : 5","0 : 0","3 : 1","1 : 3","0 : 3","1 : 3","1 : 3","0 : 0","2 : 5","5 : 2","9 : 2","1 : 0","1 : 0","0 : 0","1 : 3","0 : 0","0 : 0","0 : 3","4 : 0","5 : 1","","","","","","","","","","","","","","","3 : 1","","","","","","","","","","","","","","","","","","","","","","","","",""]
[null,20,"Sporting Lissabon",null,null,null,20,13,2,"Juventus Turin","-","Manchester City",2,":",0,null,20,"Young Boys Bern",40,17,6,17,70,":",84,-14,57,"","Young Boys Bern","","","","","","1 : 3","0 : 0","0 : 4","2 : 9","0 : 1","5 : 2","0 : 3","3 : 0","3 : 1","0 : 0","2 : 5","1 : 0","5 : 2","3 : 1","3 : 1","1 : 3","2 : 5","3 : 1","1 : 0","","3 : 1","2 : 5","1 : 3","3 : 1","0 : 0","3 : 1","0 : 0","1 : 5","3 : 0","4 : 0","1 : 3","1 : 5","5 : 1","0 : 3","2 : 9","0 : 0","3 : 0","3 : 0","0 : 0","0 : 4","","","","","","","","","","","","","","","","","","","","","","","","","","","","","0 : 2","","","","","","","","","","",""]
[null,21,"PSV Eindhoven",null,null,null,21,29,3,"Aston Villa","-","FC Bayern München",0,":",0,null,21,"Sturm Graz",40,17,5,18,77,":",67,10,56,"","Sturm Graz","","","","","","2 : 5","0 : 3","1 : 3","0 : 0","2 : 5","2 : 0","0 : 3","5 : 2","0 : 3","1 : 3","2 : 0","0 : 0","1 : 3","3 : 0","0 : 0","0 : 1","0 : 0","4 : 0","5 : 2","1 : 3","","3 : 1","0 : 3","0 : 1","1 : 5","4 : 0","4 : 0","5 : 1","1 : 0","3 : 1","0 : 1","1 : 3","0 : 2","3 : 1","0 : 0","9 : 2","5 : 2","3 : 1","5 : 1","1 : 3","","","","","","","","","","","","","0 : 3","","","","","","","","","","","","","","","","","","","","","","","","","","",""]
[null,22,"Celtic Glasgow",null,null,null,22,25,31,"OSC Lille","-","FC Girona",3,":",0,null,22,"Eintracht Frankfurt",40,16,6,18,87,":",77,10,54,"","Eintracht Frankfurt","","","","","","2 : 9","5 : 2","1 : 3","1 : 3","4 : 0","1 : 5","0 : 1","0 : 3","0 : 3","1 : 3","9 : 2","0 : 4","0 : 0","0 : 0","0 : 0","3 : 0","3 : 1","5 : 1","0 : 0","5 : 2","1 : 3","","0 : 4","4 : 0","5 : 1","9 : 2","0 : 0","9 : 2","2 : 5","0 : 3","4 : 0","3 : 1","3 : 1","0 : 4","3 : 0","0 : 3","1 : 2","0 : 1","1 : 3","2 : 0","","","","","","","","","","0 : 0","","","","","","","","","","","","","","","","","","","","","","","","","","","","","",""]
[null,23,"Dinamo Zagreb",null,null,null,23,4,24,"Paris Saint-Germain","-","Red Bull Salzburg",0,":",0,null,23,"RB Leipzig",40,16,5,19,63,":",61,2,53,"","RB Leipzig","","","","","","0 : 3","0 : 0","2 : 0","0 : 3","0 : 2","0 : 2","3 : 1","0 : 4","1 : 3","0 : 1","0 : 1","0 : 0","0 : 3","5 : 2","1 : 3","4 : 0","1 : 3","1 : 3","1 : 3","3 : 1","3 : 0","4 : 0","","5 : 2","3 : 1","0 : 3","5 : 1","3 : 1","0 : 1","1 : 3","2 : 0","0 : 0","5 : 2","3 : 1","3 : 0","1 : 3","0 : 0","0 : 2","0 : 3","3 : 0","","","","","","","","","","","","","","","","","","","","","","","","0 : 0","","","","","","","","","","","","","","","",""]
[null,24,"Red Bull Salzburg",null,null,null,24,18,8,"AC Mailand","-","RB Leipzig",1,":",0,null,24,"OSC Lille",40,15,8,17,63,":",76,-13,53,"","OSC Lille","","","","","","0 : 0","0 : 1","3 : 1","2 : 5","0 : 0","0 : 3","2 : 5","0 : 0","2 : 1","0 : 0","0 : 4","0 : 0","3 : 1","2 : 9","0 : 3","1 : 5","3 : 1","0 : 3","3 : 1","1 : 3","1 : 0","0 : 4","2 : 5","","0 : 3","0 : 0","3 : 0","4 : 0","1 : 0","1 : 3","0 : 0","1 : 3","2 : 5","5 : 2","3 : 1","3 : 1","3 : 0","9 : 2","0 : 1","3 : 0","","","","","","","","","","","","","","","","","","","","","","","0 : 0","","","","","","","","","","","","","","","","",""]
[null,25,"OSC Lille",null,null,null,25,33,17,"Sturm Graz","-","Schachtjor Donezk",0,":",3,null,25,"Mainz 05",40,16,5,19,65,":",83,-18,53,"","Mainz 05","","","","","","0 : 0","0 : 0","0 : 1","3 : 0","2 : 9","0 : 0","3 : 1","2 : 5","3 : 1","1 : 3","1 : 0","0 : 2","0 : 4","0 : 3","0 : 3","2 : 9","5 : 1","0 : 3","3 : 0","0 : 0","5 : 1","1 : 5","1 : 3","3 : 0","","1 : 5","0 : 4","3 : 1","0 : 0","0 : 2","0 : 2","1 : 0","3 : 0","3 : 1","2 : 0","1 : 5","4 : 0","9 : 2","0 : 3","3 : 1","","","","","","0 : 3","","","","","","","","","","","","","","","","","","","","","","","","","","","","","","","","","",""]
[null,26,"Roter Stern Belgrad",null,null,null,26,16,35,"FC Brügge","-","Eintracht Frankfurt",5,":",1,null,26,"Feyenoord Rotterdam",40,16,5,19,57,":",77,-20,53,"","Feyenoord Rotterdam","","","","","","5 : 2","0 : 3","0 : 3","0 : 3","3 : 1","0 : 2","1 : 3","3 : 0","2 : 9","1 : 5","0 : 1","1 : 0","0 : 0","2 : 0","0 : 0","1 : 0","0 : 3","2 : 5","3 : 1","1 : 3","0 : 4","2 : 9","3 : 0","0 : 0","5 : 1","","1 : 0","0 : 1","3 : 0","1 : 3","5 : 2","3 : 1","0 : 0","2 : 0","0 : 2","0 : 0","0 : 3","0 : 2","3 : 0","3 : 0","","","","","","","","","","","","","","","","","1 : 5","","","","","","","","","","","","","","","","","","","","","","",""]
[null,27,"Young Boys Bern",null,null,null,27,32,23,"VfB Stuttgart","-","Dinamo Zagreb",0,":",4,null,27,"PSV Eindhoven",39,15,7,17,73,":",75,-2,52,"","PSV Eindhoven","","","","","","0 : 0","3 : 0","2 : 0","1 : 5","1 : 3","0 : 0","2 : 9","5 : 1","1 : 5","0 : 3","1 : 3","2 : 9","0 : 0","3 : 0","5 : 2","0 : 3","0 : 0","0 : 4","3 : 1","0 : 0","0 : 4","0 : 0","1 : 5","0 : 3","4 : 0","0 : 1","","3 : 0","5 : 1","2 : 0","0 : 3","3 : 0","0 : 0","9 : 2","0 : 1","1 : 2","1 : 3","2 : 0","4 : 0","9 : 2","","","","","","","","","","","","","","","","","","","","","","","","","","","","","","","","","","","","","","","",""]
[null,28,"AS Monaco",null,null,null,28,15,36,"FC Arsenal","-","Mainz 05",5,":",2,null,28,"FC Bayern München",40,16,4,20,66,":",82,-16,52,"","FC Bayern München","","","","","","0 : 3","0 : 2","2 : 5","0 : 2","3 : 0","1 : 3","1 : 5","0 : 4","3 : 1","5 : 2","1 : 3","2 : 0","3 : 0","1 : 2","4 : 0","5 : 1","0 : 0","2 : 0","0 : 0","5 : 1","1 : 5","2 : 9","1 : 3","0 : 4","1 : 3","1 : 0","0 : 3","","3 : 1","4 : 0","0 : 0","0 : 4","3 : 1","0 : 3","2 : 5","0 : 2","5 : 1","1 : 0","0 : 0","3 : 1","","","","","","","","","","","","","","","","","","","","","","","","","","","","","","","","","","","","","","","","1 : 3"]
[null,29,"Aston Villa",null,null,null,29,19,12,"Feyenoord Rotterdam","-","Atalanta Bergamo",3,":",1,null,29,"Inter Mailand",40,15,6,19,64,":",62,2,51,"","Inter Mailand","","","","","","1 : 3","1 : 3","0 : 3","0 : 0","1 : 3","4 : 0","0 : 2","2 : 0","0 : 3","0 : 2","1 : 3","0 : 0","5 : 2","2 : 5","0 : 0","0 : 0","0 : 1","3 : 0","5 : 2","0 : 3","0 : 1","5 : 2","1 : 0","0 : 1","0 : 0","0 : 3","1 : 5","1 : 3","","0 : 0","3 : 0","3 : 0","1 : 3","1 : 3","3 : 0","3 : 1","3 : 0","1 : 3","2 : 0","9 : 2","","","","","","","","","","","","","","","","","","","","2 : 0","","","","","","","","","","","","","","","","","","","",""]
[null,30,"FC Bologna",null,null,null,30,1,34,"Real Madrid","-","Stade Brest",0,":",3,null,30,"Manchester City",39,15,6,18,56,":",67,-11,51,"","Manchester City","","","","","","0 : 3","3 : 0","1 : 0","0 : 0","0 : 3","2 : 5","0 : 0","3 : 1","3 : 0","0 : 0","0 : 3","0 : 1","1 : 3","1 : 3","0 : 0","3 : 1","1 : 3","2 : 0","2 : 5","0 : 4","1 : 3","3 : 0","3 : 1","3 : 1","2 : 0","3 : 1","0 : 2","0 : 4","0 : 0","","0 : 2","0 : 0","5 : 1","1 : 5","2 : 5","5 : 2","0 : 3","3 : 1","3 : 0","0 : 1","","","","","","","","","","","","","","","","","","","","","","","","","","","","","","","","","","","","","","","",""]
[null,31,"FC Girona",null,null,null,31,9,20,"FC Barcelona","-","Sporting Lissabon",9,":",2,null,31,"Juventus Turin",39,15,6,18,55,":",81,-26,51,"","Juventus Turin","","","","","","3 : 1","0 : 3","1 : 5","0 : 0","2 : 1","5 : 1","0 : 0","1 : 3","0 : 1","0 : 3","2 : 5","2 : 9","2 : 5","1 : 0","0 : 1","0 : 3","0 : 4","0 : 0","2 : 9","3 : 1","1 : 0","0 : 4","0 : 2","0 : 0","2 : 0","2 : 5","3 : 0","0 : 0","0 : 3","2 : 0","","1 : 3","5 : 2","3 : 1","3 : 0","0 : 4","3 : 1","3 : 1","0 : 0","3 : 0","","","","","","","","","","","","","","","","","","","","","","","","","","","","","","","","","","","","","","","",""]
[null,32,"VfB Stuttgart",null,null,null,32,40,37,"Hertha BSC","-","AC Roma",3,":",1,null,32,"Borussia Dortmund",40,15,5,20,64,":",74,-10,50,"","Borussia Dortmund","","","","","","1 : 5","0 : 0","2 : 5","2 : 9","0 : 0","1 : 3","0 : 3","0 : 0","2 : 0","4 : 0","1 : 3","5 : 2","0 : 3","1 : 3","1 : 3","0 : 3","5 : 2","0 : 3","0 : 1","5 : 1","3 : 1","1 : 3","0 : 0","3 : 1","0 : 1","1 : 3","0 : 3","4 : 0","0 : 3","0 : 0","3 : 1","","0 : 2","3 : 0","0 : 2","1 : 0","3 : 0","3 : 0","1 : 2","5 : 2","","","","","","","","","","","3 : 1","","","","","","","","","","","","","","","","","","","","","","","","","","","","",""]
[null,33,"Sturm Graz",null,null,null,33,38,30,"FC Basel","-","FC Bologna",1,":",3,null,33,"FC Lille",39,15,4,20,69,":",74,-5,49,"","FC Lille","","","","","","0 : 3","1 : 3","0 : 2","3 : 1","3 : 0","9 : 2","0 : 3","0 : 1","1 : 3","1 : 0","0 : 3","3 : 0","0 : 1","3 : 1","9 : 2","0 : 4","2 : 0","1 : 5","0 : 1","1 : 5","2 : 0","1 : 3","2 : 5","5 : 2","0 : 3","0 : 0","0 : 0","1 : 3","3 : 1","1 : 5","2 : 5","2 : 0","","5 : 1","4 : 0","0 : 0","1 : 3","0 : 3","3 : 0","0 : 0","","","","","","","","","","","","","","","","","","","","","","","","","","","","","","","","","","","","","","","",""]
[null,34,"Stade Brest",null,null,null,34,7,14,"Borussia Dortmund","-","Benfica Lissabon",2,":",0,null,34,"VfB Stuttgart",40,14,6,20,76,":",87,-11,48,"","VfB Stuttgart","","","","","","0 : 0","0 : 2","5 : 1","0 : 3","5 : 5","4 : 0","1 : 5","3 : 1","3 : 0","0 : 3","1 : 3","3 : 1","5 : 2","0 : 3","3 : 0","9 : 2","0 : 4","0 : 3","0 : 0","3 : 0","1 : 3","4 : 0","1 : 3","2 : 5","1 : 3","0 : 2","2 : 9","3 : 0","3 : 1","5 : 1","1 : 3","0 : 3","1 : 5","","0 : 4","5 : 1","0 : 0","2 : 5","0 : 0","0 : 0","","0 : 1","","","","","","","","","","","","","","","","","","","","","","","","","","","","","","","","","","","","","",""]
[null,35,"Eintracht Frankfurt",null,null,null,35,22,6,"Celtic Glasgow","-","Inter Mailand",0,":",0,null,35,"AS Monaco",39,13,5,21,62,":",77,-15,44,"","AS Monaco","","","","","","0 : 2","5 : 1","0 : 1","0 : 3","1 : 3","0 : 3","0 : 4","1 : 3","0 : 3","0 : 2","3 : 0","0 : 0","1 : 3","1 : 5","0 : 1","1 : 3","3 : 1","2 : 9","3 : 1","9 : 2","0 : 0","0 : 3","0 : 3","1 : 3","0 : 2","2 : 0","1 : 0","5 : 2","0 : 3","5 : 2","0 : 3","2 : 0","0 : 4","4 : 0","","9 : 2","0 : 0","3 : 0","0 : 0","0 : 0","","","","","","","","","","","","","","","","","","","","","","","","","","","","","","","","","","","","","","","",""]
[null,36,"Mainz 05",null,null,null,36,28,26,"AS Monaco","-","Roter Stern Belgrad",3,":",0,null,36,"Atletico Madrid",39,12,8,19,55,":",90,-35,44,"","Atletico Madrid","","","","","","0 : 3","1 : 5","0 : 0","0 : 3","0 : 3","3 : 1","0 : 4","5 : 2","1 : 3","3 : 0","0 : 0","1 : 5","0 : 0","3 : 1","2 : 9","2 : 5","0 : 2","3 : 0","0 : 0","0 : 0","2 : 9","3 : 0","3 : 1","1 : 3","5 : 1","0 : 0","2 : 1","2 : 0","1 : 3","2 : 5","4 : 0","0 : 1","0 : 0","1 : 5","2 : 9","","0 : 0","3 : 0","0 : 3","0 : 3","","","","","","","","","","","","","","","","","","","","","","","","","","","","","","","","","","","","","","","",""]
[null,37,"AC Roma",null,null,null,37,27,11,"Young Boys Bern","-","Atletico Madrid",0,":",0,null,37,"FC Liverpool",39,12,8,19,51,":",92,-41,44,"","FC Liverpool","","","","","","0 : 3","2 : 9","2 : 9","0 : 4","0 : 2","0 : 0","2 : 1","1 : 5","0 : 0","0 : 4","3 : 1","2 : 5","1 : 0","0 : 3","1 : 3","3 : 0","4 : 0","1 : 0","0 : 0","0 : 3","2 : 5","2 : 1","0 : 0","0 : 3","0 : 4","3 : 0","3 : 1","1 : 5","0 : 3","3 : 0","1 : 3","0 : 3","3 : 1","0 : 0","0 : 0","0 : 0","","0 : 0","9 : 2","2 : 9","","","","","","","","","","","","","","","","","","","","","","","","","","","","","","","","","","","","","","","",""]
[null,38,"FC Basel",null,null,null,38,5,10,"FC Liverpool","-","Bayer Leverkusen",1,":",0,null,38,"Paris Saint-Germain",40,13,4,23,56,":",88,-32,43,"","Paris Saint-Germain","","","","","","0 : 1","1 : 3","1 : 5","5 : 1","3 : 1","0 : 3","1 : 3","0 : 0","0 : 0","3 : 0","5 : 2","2 : 5","0 : 0","0 : 1","1 : 3","0 : 2","1 : 5","3 : 1","3 : 0","0 : 3","1 : 3","1 : 0","2 : 0","2 : 9","2 : 9","2 : 0","0 : 2","0 : 1","3 : 1","1 : 3","1 : 3","0 : 3","3 : 0","5 : 2","0 : 3","0 : 3","0 : 0","","3 : 0","1 : 5","","","","","","","","","","","","","","","","","","","","","","","","","","","","","","","","","","","","","","","0 : 2",""]
[null,39,"FC Lille",null,null,null,39,21,13,"PSV Eindhoven","-","Juventus Turin",0,":",3,null,39,"Aston Villa",40,12,6,22,47,":",97,-50,42,"","Aston Villa","","","","","","2 : 9","0 : 1","0 : 3","2 : 0","1 : 0","0 : 0","3 : 0","2 : 5","1 : 5","3 : 1","1 : 3","0 : 3","2 : 5","1 : 3","1 : 5","0 : 4","2 : 9","5 : 1","0 : 4","0 : 0","1 : 5","3 : 1","3 : 0","1 : 0","3 : 0","0 : 3","0 : 4","0 : 0","0 : 2","0 : 3","0 : 0","2 : 1","0 : 3","0 : 0","0 : 0","3 : 0","2 : 9","0 : 3","","1 : 2","","","","","","","","","","","","","","","","","","","","","","","","","","","","","","","","","","","","","","2 : 0","",""]
[null,40,"Hertha BSC",null,null,null,40,2,39,"Manchester City","-","FC Lille",5,":",1,null,40,"FC Girona",40,10,8,22,48,":",96,-48,38,"","FC Girona","","","","","","0 : 4","2 : 9","3 : 0","0 : 0","0 : 4","0 : 3","0 : 0","2 : 1","0 : 3","1 : 3","0 : 2","0 : 3","0 : 0","0 : 0","0 : 2","0 : 0","0 : 3","1 : 5","1 : 5","4 : 0","3 : 1","0 : 2","0 : 3","0 : 3","1 : 3","0 : 3","2 : 9","1 : 3","2 : 9","1 : 0","0 : 3","2 : 5","0 : 0","0 : 0","0 : 0","3 : 0","9 : 2","5 : 1","2 : 1","","","","","","","","","","","","","","","","","","","","","","","","","","","","","3 : 1","","","","","","","","","","","",""]
[null,null,null,null,null,null,41,3,25,"FC Bayern München","-","OSC Lille",0,":",4]
[null,null,null,null,null,null,42,24,29,"Red Bull Salzburg","-","Aston Villa",5,":",2]
[null,null,null,null,null,null,43,31,18,"FC Girona","-","AC Mailand",1,":",3]
[null,null,null,null,null,null,44,17,4,"Schachtjor Donezk","-","Paris Saint-Germain",3,":",1]
[null,null,null,null,null,null,45,8,16,"RB Leipzig","-","FC Brügge",0,":",2]
[null,null,null,null,null,null,46,23,33,"Dinamo Zagreb","-","Sturm Graz",0,":",0]
[null,null,null,null,null,null,47,35,15,"Eintracht Frankfurt","-","FC Arsenal",0,":",3]
[null,null,null,null,null,null,48,12,32,"Atalanta Bergamo","-","VfB Stuttgart",5,":",5]
[null,null,null,null,null,null,49,36,1,"Mainz 05","-","Real Madrid",0,":",1]
[null,null,null,null,null,null,50,20,19,"Sporting Lissabon","-","Feyenoord Rotterdam",3,":",0]
[null,null,null,null,null,null,51,34,40,"Stade Brest","-","Hertha BSC",1,":",5]
[null,null,null,null,null,null,52,30,9,"FC Bologna","-","FC Barcelona",4,":",0]
[null,null,null,null,null,null,53,37,7,"AC Roma","-","Borussia Dortmund",2,":",5]
[null,null,null,null,null,null,54,6,38,"Inter Mailand","-","FC Basel",1,":",3]
[null,null,null,null,null,null,55,14,28,"Benfica Lissabon","-","AS Monaco",3,":",0]
[null,null,null,null,null,null,56,11,22,"Atletico Madrid","-","Celtic Glasgow",2,":",9]
[null,null,null,null,null,null,57,26,5,"Roter Stern Belgrad","-","FC Liverpool",1,":",3]
[null,null,null,null,null,null,58,13,27,"Juventus Turin","-","Young Boys Bern",3,":",1]
[null,null,null,null,null,null,59,10,2,"Bayer Leverkusen","-","Manchester City",0,":",2]
[null,null,null,null,null,null,60,39,21,"FC Lille","-","PSV Eindhoven",0,":",0]
[null,null,null,null,null,null,61,24,3,"Red Bull Salzburg","-","FC Bayern München",0,":",3]
[null,null,null,null,null,null,62,18,25,"AC Mailand","-","OSC Lille",0,":",0]
[null,null,null,null,null,null,63,29,17,"Aston Villa","-","Schachtjor Donezk",0,":",1]
[null,null,null,null,null,null,64,16,31,"FC Brügge","-","FC Girona",3,":",0]
[null,null,null,null,null,null,65,4,23,"Paris Saint-Germain","-","Dinamo Zagreb",1,":",5]
[null,null,null,null,null,null,66,15,8,{"$f":"IFERROR(VLOOKUP($H71,$B$6:$C$45,2,0),\"\")","v":"FC Arsenal"},"-",{"$f":"IFERROR(VLOOKUP($I71,$B$6:$C$45,2,0),\"\")","v":"RB Leipzig"},4,":",0]
[null,null,null,null,null,null,67,33,12,"Sturm Graz","-","Atalanta Bergamo",2,":",5]
[null,null,null,null,null,null,68,1,35,"Real Madrid","-","Eintracht Frankfurt",3,":",1]
[null,null,null,null,null,null,69,32,20,"VfB Stuttgart","-","Sporting Lissabon",0,":",3]
[null,null,null,null,null,null,70,40,36,"Hertha BSC","-","Mainz 05",9,":",2]
[null,null,null,null,null,null,71,19,30,"Feyenoord Rotterdam","-","FC Bologna",3,":",1]
[null,null,null,null,null,null,72,7,34,"Borussia Dortmund","-","Stade Brest",1,":",3]
[null,null,null,null,null,null,73,9,6,"FC Barcelona","-","Inter Mailand",2,":",0]
[null,null,null,null,null,null,74,28,37,"AS Monaco","-","AC Roma",0,":",0]
[null,null,null,null,null,null,75,38,11,"FC Basel","-","Atletico Madrid",3,":",0]
[null,null,null,null,null,null,76,5,14,"FC Liverpool","-","Benfica Lissabon",0,":",0]
[null,null,null,null,null,null,77,22,13,"Celtic Glasgow","-","Juventus Turin",1,":",0]
[null,null,null,null,null,null,78,2,26,"Manchester City","-","Roter Stern Belgrad",0,":",3]
[null,null,null,null,null,null,79,27,39,"Young Boys Bern","-","FC Lille",5,":",1]
[null,null,null,null,null,null,80,21,10,"PSV Eindhoven","-","Bayer Leverkusen",0,":",4]
[null,null,null,null,null,null,81,3,18,"FC Bayern München","-","AC Mailand",5,":",2]
[null,null,null,null,null,null,82,17,24,"Schachtjor Donezk","-","Red Bull Salzburg",3,":",1]
[null,null,null,null,null,null,83,25,16,"OSC Lille","-","FC Brügge",0,":",3]
[null,null,null,null,null,null,84,23,29,"Dinamo Zagreb","-","Aston Villa",9,":",2]
[null,null,null,null,null,null,85,31,15,"FC Girona","-","FC Arsenal",2,":",1]
[null,null,null,null,null,null,86,12,4,"Atalanta Bergamo","-","Paris Saint-Germain",1,":",3]
[null,null,null,null,null,null,87,8,1,"RB Leipzig","-","Real Madrid",2,":",0]
[null,null,null,null,null,null,88,20,33,"Sporting Lissabon","-","Sturm Graz",0,":",0]
[null,null,null,null,null,null,89,35,40,"Eintracht Frankfurt","-","Hertha BSC",3,":",0]
[null,null,null,null,null,null,90,30,32,"FC Bologna","-","VfB Stuttgart",0,":",0]
[null,null,null,null,null,null,91,36,7,"Mainz 05","-","Borussia Dortmund",1,":",0]
[null,null,null,null,null,null,92,6,19,"Inter Mailand","-","Feyenoord Rotterdam",0,":",3]
[null,null,null,null,null,null,93,34,28,"Stade Brest","-","AS Monaco",5,":",1]
[null,null,null,null,null,null,94,11,9,"Atletico Madrid","-","FC Barcelona",0,":",4]
[null,null,null,null,null,null,95,37,5,"AC Roma","-","FC Liverpool",5,":",2]
[null,null,null,null,null,null,96,13,38,"Juventus Turin","-","FC Basel",3,":",1]
[null,null,null,null,null,null,97,14,2,"Benfica Lissabon","-","Manchester City",0,":",3]
[null,null,null,null,null,null,98,39,22,"FC Lille","-","Celtic Glasgow",9,":",2]
[null,null,null,null,null,null,99,26,21,"Roter Stern Belgrad","-","PSV Eindhoven",3,":",1]
[null,null,null,null,null,null,100,10,27,"Bayer Leverkusen","-","Young Boys Bern",1,":",3]
[null,null,null,null,null,null,101,17,3,"Schachtjor Donezk","-","FC Bayern München",2,":",0]
[null,null,null,null,null,null,102,16,18,"FC Brügge","-","AC Mailand",0,":",0]
[null,null,null,null,null,null,103,24,23,"Red Bull Salzburg","-","Dinamo Zagreb",3,":",0]
[null,null,null,null,null,null,104,15,25,"FC Arsenal","-","OSC Lille",0,":",0]
[null,null,null,null,null,null,105,29,12,"Aston Villa","-","Atalanta Bergamo",1,":",0]
[null,null,null,null,null,null,106,1,31,"Real Madrid","-","FC Girona",0,":",3]
[null,null,null,null,null,null,107,4,20,"Paris Saint-Germain","-","Sporting Lissabon",5,":",1]
[null,null,null,null,null,null,108,40,8,"Hertha BSC","-","RB Leipzig",0,":",4]
[null,null,null,null,null,null,109,33,30,"Sturm Graz","-","FC Bologna",5,":",2]
[null,null,null,null,null,null,110,7,35,"Borussia Dortmund","-","Eintracht Frankfurt",1,":",3]
[null,null,null,null,null,null,111,32,6,"VfB Stuttgart","-","Inter Mailand",3,":",1]
[null,null,null,null,null,null,112,28,36,"AS Monaco","-","Mainz 05",0,":",2]
[null,null,null,null,null,null,113,19,11,"Feyenoord Rotterdam","-","Atletico Madrid",0,":",0]
[null,null,null,null,null,null,114,5,34,"FC Liverpool","-","Stade Brest",0,":",3]
[null,null,null,null,null,null,115,9,13,"FC Barcelona","-","Juventus Turin",0,":",0]
[null,null,null,null,null,null,116,2,37,"Manchester City","-","AC Roma",0,":",1]
[null,null,null,null,null,null,117,38,39,"FC Basel","-","FC Lille",3,":",0]
[null,null,null,null,null,null,118,21,14,"PSV Eindhoven","-","Benfica Lissabon",1,":",5]
[null,null,null,null,null,null,119,22,10,"Celtic Glasgow","-","Bayer Leverkusen",4,":",0]
[null,null,null,null,null,null,120,27,26,"Young Boys Bern","-","Roter Stern Belgrad",2,":",5]
[null,null,null,null,null,null,121,3,16,"FC Bayern München","-","FC Brügge",1,":",3]
[null,null,null,null,null,null,122,23,17,"Dinamo Zagreb","-","Schachtjor Donezk",3,":",0]
[null,null,null,null,null,null,123,18,15,"AC Mailand","-","FC Arsenal",2,":",9]
[null,null,null,null,null,null,124,12,24,"Atalanta Bergamo","-","Red Bull Salzburg",1,":",3]
[null,null,null,null,null,null,125,25,1,"OSC Lille","-","Real Madrid",3,":",1]
[null,null,null,null,null,null,126,20,29,"Sporting Lissabon","-","Aston Villa",0,":",2]
[null,null,null,null,null,null,127,31,40,"FC Girona","-","Hertha BSC",0,":",0]
[null,null,null,null,null,null,128,30,4,"FC Bologna","-","Paris Saint-Germain",0,":",3]
[null,null,null,null,null,null,129,8,7,"RB Leipzig","-","Borussia Dortmund",0,":",0]
[null,null,null,null,null,null,130,6,33,{"$f":"IFERROR(VLOOKUP($H135,$B$6:$C$45,2,0),\"\")","v":"Inter Mailand"},"-",{"$f":"IFERROR(VLOOKUP($I135,$B$6:$C$45,2,0),\"\")","v":"Sturm Graz"},0,":",1]
[null,null,null,null,null,null,131,35,28,"Eintracht Frankfurt","-","AS Monaco",3,":",0]
[null,null,null,null,null,null,132,11,32,"Atletico Madrid","-","VfB Stuttgart",1,":",5]
[null,null,null,null,null,null,133,36,5,"Mainz 05","-","FC Liverpool",4,":",0]
[null,null,null,null,null,null,134,13,19,"Juventus Turin","-","Feyenoord Rotterdam",2,":",5]
[null,null,null,null,null,null,135,34,2,"Stade Brest","-","Manchester City",3,":",1]
[null,null,null,null,null,null,136,39,9,"FC Lille","-","FC Barcelona",0,":",3]
[null,null,null,null,null,null,137,37,21,"AC Roma","-","PSV Eindhoven",9,":",2]
[null,null,null,null,null,null,138,10,38,"Bayer Leverkusen","-","FC Basel",3,":",1]
[null,null,null,null,null,null,139,14,27,"Benfica Lissabon","-","Young Boys Bern",1,":",3]
[null,null,null,null,null,null,140,26,22,"Roter Stern Belgrad","-","Celtic Glasgow",2,":",0]
[null,null,null,null,null,null,141,23,3,"Dinamo Zagreb","-","FC Bayern München",0,":",0]
[null,null,null,null,null,null,142,15,16,"FC Arsenal","-","FC Brügge",3,":",0]
[null,null,null,null,null,null,143,17,12,"Schachtjor Donezk","-","Atalanta Bergamo",0,":",0]
[null,null,null,null,null,null,144,1,18,"Real Madrid","-","AC Mailand",1,":",0]
[null,null,null,null,null,null,145,24,20,"Red Bull Salzburg","-","Sporting Lissabon",0,":",3]
[null,null,null,null,null,null,146,40,25,"Hertha BSC","-","OSC Lille",5,":",1]
[null,null,null,null,null,null,147,29,30,"Aston Villa","-","FC Bologna",0,":",4]
[null,null,null,null,null,null,148,7,31,"Borussia Dortmund","-","FC Girona",5,":",2]
[null,null,null,null,null,null,149,4,6,"Paris Saint-Germain","-","Inter Mailand",3,":",1]
[null,null,null,null,null,null,150,28,8,"AS Monaco","-","RB Leipzig",0,":",3]
[null,null,null,null,null,null,151,33,11,"Sturm Graz","-","Atletico Madrid",9,":",2]
[null,null,null,null,null,null,152,5,35,"FC Liverpool","-","Eintracht Frankfurt",2,":",1]
[null,null,null,null,null,null,153,32,13,"VfB Stuttgart","-","Juventus Turin",1,":",3]
[null,null,null,null,null,null,154,2,36,"Manchester City","-","Mainz 05",2,":",0]
[null,null,null,null,null,null,155,19,39,"Feyenoord Rotterdam","-","FC Lille",0,":",0]
[null,null,null,null,null,null,156,21,34,"PSV Eindhoven","-","Stade Brest",3,":",0]
[null,null,null,null,null,null,157,9,10,"FC Barcelona","-","Bayer Leverkusen",0,":",0]
[null,null,null,null,null,null,158,27,37,"Young Boys Bern","-","AC Roma",1,":",0]
[null,null,null,null,null,null,159,38,26,"FC Basel","-","Roter Stern Belgrad",0,":",3]
[null,null,null,null,null,null,160,22,14,"Celtic Glasgow","-","Benfica Lissabon",5,":",1]
[null,null,null,null,null,null,161,3,15,"FC Bayern München","-","FC Arsenal",0,":",4]
[null,null,null,null,null,null,162,12,23,"Atalanta Bergamo","-","Dinamo Zagreb",5,":",2]
[null,null,null,null,null,null,163,16,1,"FC Brügge","-","Real Madrid",3,":",1]
[null,null,null,null,null,null,164,20,17,"Sporting Lissabon","-","Schachtjor Donezk",0,":",3]
[null,null,null,null,null,null,165,18,40,"AC Mailand","-","Hertha BSC",9,":",2]
[null,null,null,null,null,null,166,30,24,"FC Bologna","-","Red Bull Salzburg",3,":",1]
[null,null,null,null,null,null,167,25,7,"OSC Lille","-","Borussia Dortmund",1,":",3]
[null,null,null,null,null,null,168,6,29,"Inter Mailand","-","Aston Villa",2,":",0]
[null,null,null,null,null,null,169,31,28,"FC Girona","-","AS Monaco",0,":",0]
[null,null,null,null,null,null,170,11,4,"Atletico Madrid","-","Paris Saint-Germain",3,":",0]
[null,null,null,null,null,null,171,8,5,"RB Leipzig","-","FC Liverpool",0,":",0]
[null,null,null,null,null,null,172,13,33,"Juventus Turin","-","Sturm Graz",1,":",0]
[null,null,null,null,null,null,173,35,2,"Eintracht Frankfurt","-","Manchester City",0,":",3]
[null,null,null,null,null,null,174,39,32,"FC Lille","-","VfB Stuttgart",5,":",1]
[null,null,null,null,null,null,175,36,21,"Mainz 05","-","PSV Eindhoven",0,":",4]
[null,null,null,null,null,null,176,10,19,"Bayer Leverkusen","-","Feyenoord Rotterdam",5,":",2]
[null,null,null,null,null,null,177,34,27,"Stade Brest","-","Young Boys Bern",1,":",3]
[null,null,null,null,null,null,178,26,9,"Roter Stern Belgrad","-","FC Barcelona",3,":",1]
[null,null,null,null,null,null,179,37,22,"AC Roma","-","Celtic Glasgow",0,":",2]
[null,null,null,null,null,null,180,14,38,"Benfica Lissabon","-","FC Basel",0,":",0]
[null,null,null,null,null,null,181,12,3,"Atalanta Bergamo","-","FC Bayern München",0,":",3]
[null,null,null,null,null,null,182,1,15,"Real Madrid","-","FC Arsenal",0,":",0]
[null,null,null,null,null,null,183,23,20,"Dinamo Zagreb","-","Sporting Lissabon",0,":",1]
[null,null,null,null,null,null,184,40,16,"Hertha BSC","-","FC Brügge",3,":",0]
[null,null,null,null,null,null,185,17,30,"Schachtjor Donezk","-","FC Bologna",1,":",5]
[null,null,null,null,null,null,186,7,18,"Borussia Dortmund","-","AC Mailand",4,":",0]
[null,null,null,null,null,null,187,24,6,"Red Bull Salzburg","-","Inter Mailand",2,":",5]
[null,null,null,null,null,null,188,28,25,"AS Monaco","-","OSC Lille",1,":",3]
[null,null,null,null,null,null,189,29,11,"Aston Villa","-","Atletico Madrid",3,":",0]
[null,null,null,null,null,null,190,5,31,"FC Liverpool","-","FC Girona",2,":",9]
[null,null,null,null,null,null,191,4,13,"Paris Saint-Germain","-","Juventus Turin",1,":",3]
[null,null,null,null,null,null,192,2,8,"Manchester City","-","RB Leipzig",3,":",1]
[null,null,null,null,null,null,193,33,39,"Sturm Graz","-","FC Lille",0,":",2]
[null,null,null,null,null,null,194,21,35,{"$f":"IFERROR(VLOOKUP($H199,$B$6:$C$45,2,0),\"\")","v":"PSV Eindhoven"},"-",{"$f":"IFERROR(VLOOKUP($I199,$B$6:$C$45,2,0),\"\")","v":"Eintracht Frankfurt"},0,":",0]
[null,null,null,null,null,null,195,32,10,"VfB Stuttgart","-","Bayer Leverkusen",0,":",3]
[null,null,null,null,null,null,196,27,36,"Young Boys Bern","-","Mainz 05",0,":",0]
[null,null,null,null,null,null,197,19,26,"Feyenoord Rotterdam","-","Roter Stern Belgrad",0,":",1]
[null,null,null,null,null,null,198,22,34,"Celtic Glasgow","-","Stade Brest",3,":",0]
[null,null,null,null,null,null,199,9,14,"FC Barcelona","-","Benfica Lissabon",1,":",5]
[null,null,null,null,null,null,200,38,37,"FC Basel","-","AC Roma",4,":",0]
[null,null,null,null,null,null,201,3,1,"FC Bayern München","-","Real Madrid",2,":",5]
[null,null,null,null,null,null,202,20,12,"Sporting Lissabon","-","Atalanta Bergamo",3,":",1]
[null,null,null,null,null,null,203,15,40,"FC Arsenal","-","Hertha BSC",0,":",3]
[null,null,null,null,null,null,204,30,23,"FC Bologna","-","Dinamo Zagreb",9,":",2]
[null,null,null,null,null,null,205,16,7,"FC Brügge","-","Borussia Dortmund",3,":",1]
[null,null,null,null,null,null,206,6,17,"Inter Mailand","-","Schachtjor Donezk",1,":",3]
[null,null,null,null,null,null,207,18,28,"AC Mailand","-","AS Monaco",2,":",0]
[null,null,null,null,null,null,208,11,24,"Atletico Madrid","-","Red Bull Salzburg",0,":",0]
[null,null,null,null,null,null,209,25,5,"OSC Lille","-","FC Liverpool",3,":",0]
[null,null,null,null,null,null,210,13,29,"Juventus Turin","-","Aston Villa",0,":",0]
[null,null,null,null,null,null,211,31,2,"FC Girona","-","Manchester City",1,":",0]
[null,null,null,null,null,null,212,39,4,"FC Lille","-","Paris Saint-Germain",0,":",3]
[null,null,null,null,null,null,213,8,21,"RB Leipzig","-","PSV Eindhoven",5,":",1]
[null,null,null,null,null,null,214,10,33,"Bayer Leverkusen","-","Sturm Graz",0,":",4]
[null,null,null,null,null,null,215,35,27,"Eintracht Frankfurt","-","Young Boys Bern",5,":",2]
[null,null,null,null,null,null,216,26,32,"Roter Stern Belgrad","-","VfB Stuttgart",3,":",1]
[null,null,null,null,null,null,217,36,22,"Mainz 05","-","Celtic Glasgow",0,":",3]
[null,null,null,null,null,null,218,14,19,"Benfica Lissabon","-","Feyenoord Rotterdam",9,":",2]
[null,null,null,null,null,null,219,34,38,"Stade Brest","-","FC Basel",2,":",1]
[null,null,null,null,null,null,220,37,9,"AC Roma","-","FC Barcelona",1,":",3]
[null,null,null,null,null,null,221,20,3,"Sporting Lissabon","-","FC Bayern München",2,":",0]
[null,null,null,null,null,null,222,40,1,"Hertha BSC","-","Real Madrid",0,":",0]
[null,null,null,null,null,null,223,12,30,"Atalanta Bergamo","-","FC Bologna",3,":",0]
[null,null,null,null,null,null,224,7,15,"Borussia Dortmund","-","FC Arsenal",0,":",0]
[null,null,null,null,null,null,225,23,6,"Dinamo Zagreb","-","Inter Mailand",1,":",0]
[null,null,null,null,null,null,226,28,16,"AS Monaco","-","FC Brügge",0,":",3]
[null,null,null,null,null,null,227,17,11,"Schachtjor Donezk","-","Atletico Madrid",5,":",1]
[null,null,null,null,null,null,228,5,18,"FC Liverpool","-","AC Mailand",0,":",4]
[null,null,null,null,null,null,229,24,13,"Red Bull Salzburg","-","Juventus Turin",5,":",2]
[null,null,null,null,null,null,230,2,25,"Manchester City","-","OSC Lille",3,":",1]
[null,null,null,null,null,null,231,29,39,"Aston Villa","-","FC Lille",0,":",3]
[null,null,null,null,null,null,232,21,31,"PSV Eindhoven","-","FC Girona",9,":",2]
[null,null,null,null,null,null,233,4,10,"Paris Saint-Germain","-","Bayer Leverkusen",3,":",1]
[null,null,null,null,null,null,234,27,8,"Young Boys Bern","-","RB Leipzig",1,":",3]
[null,null,null,null,null,null,235,33,26,"Sturm Graz","-","Roter Stern Belgrad",2,":",0]
[null,null,null,null,null,null,236,22,35,"Celtic Glasgow","-","Eintracht Frankfurt",0,":",0]
[null,null,null,null,null,null,237,32,14,"VfB Stuttgart","-","Benfica Lissabon",3,":",0]
[null,null,null,null,null,null,238,38,36,"FC Basel","-","Mainz 05",0,":",0]
[null,null,null,null,null,null,239,19,37,"Feyenoord Rotterdam","-","AC Roma",1,":",0]
[null,null,null,null,null,null,240,9,34,"FC Barcelona","-","Stade Brest",0,":",3]
[null,null,null,null,null,null,241,3,40,"FC Bayern München","-","Hertha BSC",5,":",1]
[null,null,null,null,null,null,242,30,20,"FC Bologna","-","Sporting Lissabon",0,":",4]
[null,null,null,null,null,null,243,1,7,"Real Madrid","-","Borussia Dortmund",5,":",2]
[null,null,null,null,null,null,244,6,12,"Inter Mailand","-","Atalanta Bergamo",1,":",3]
[null,null,null,null,null,null,245,15,28,"FC Arsenal","-","AS Monaco",3,":",1]
[null,null,null,null,null,null,246,11,23,"Atletico Madrid","-","Dinamo Zagreb",0,":",2]
[null,null,null,null,null,null,247,16,5,"FC Brügge","-","FC Liverpool",0,":",0]
[null,null,null,null,null,null,248,13,17,"Juventus Turin","-","Schachtjor Donezk",0,":",3]
[null,null,null,null,null,null,249,18,2,"AC Mailand","-","Manchester City",0,":",0]
[null,null,null,null,null,null,250,39,24,"FC Lille","-","Red Bull Salzburg",0,":",1]
[null,null,null,null,null,null,251,25,21,"OSC Lille","-","PSV Eindhoven",3,":",0]
[null,null,null,null,null,null,252,10,29,"Bayer Leverkusen","-","Aston Villa",1,":",5]
[null,null,null,null,null,null,253,31,27,"FC Girona","-","Young Boys Bern",4,":",0]
[null,null,null,null,null,null,254,26,4,"Roter Stern Belgrad","-","Paris Saint-Germain",2,":",5]
[null,null,null,null,null,null,255,8,22,"RB Leipzig","-","Celtic Glasgow",1,":",3]
[null,null,null,null,null,null,256,14,33,"Benfica Lissabon","-","Sturm Graz",3,":",0]
[null,null,null,null,null,null,257,35,38,"Eintracht Frankfurt","-","FC Basel",2,":",9]
[null,null,null,null,null,null,258,37,32,{"$f":"IFERROR(VLOOKUP($H263,$B$6:$C$45,2,0),\"\")","v":"AC Roma"},"-",{"$f":"IFERROR(VLOOKUP($I263,$B$6:$C$45,2,0),\"\")","v":"VfB Stuttgart"},1,":",3]
[null,null,null,null,null,null,259,36,9,"Mainz 05","-","FC Barcelona",3,":",1]
[null,null,null,null,null,null,260,34,19,"Stade Brest","-","Feyenoord Rotterdam",0,":",2]
[null,null,null,null,null,null,261,30,3,"FC Bologna","-","FC Bayern München",0,":",0]
[null,null,null,null,null,null,262,7,40,"Borussia Dortmund","-","Hertha BSC",0,":",3]
[null,null,null,null,null,null,263,20,6,"Sporting Lissabon","-","Inter Mailand",0,":",0]
[null,null,null,null,null,null,264,28,1,"AS Monaco","-","Real Madrid",0,":",1]
[null,null,null,null,null,null,265,12,11,"Atalanta Bergamo","-","Atletico Madrid",3,":",0]
[null,null,null,null,null,null,266,5,15,"FC Liverpool","-","FC Arsenal",1,":",5]
[null,null,null,null,null,null,267,23,13,"Dinamo Zagreb","-","Juventus Turin",4,":",0]
[null,null,null,null,null,null,268,2,16,"Manchester City","-","FC Brügge",2,":",5]
[null,null,null,null,null,null,269,17,39,"Schachtjor Donezk","-","FC Lille",3,":",1]
[null,null,null,null,null,null,270,21,18,"PSV Eindhoven","-","AC Mailand",0,":",3]
[null,null,null,null,null,null,271,24,10,"Red Bull Salzburg","-","Bayer Leverkusen",9,":",2]
[null,null,null,null,null,null,272,27,25,"Young Boys Bern","-","OSC Lille",3,":",1]
[null,null,null,null,null,null,273,29,26,"Aston Villa","-","Roter Stern Belgrad",1,":",3]
[null,null,null,null,null,null,274,22,31,"Celtic Glasgow","-","FC Girona",2,":",0]
[null,null,null,null,null,null,275,4,14,"Paris Saint-Germain","-","Benfica Lissabon",0,":",0]
[null,null,null,null,null,null,276,38,8,"FC Basel","-","RB Leipzig",3,":",0]
[null,null,null,null,null,null,277,33,37,"Sturm Graz","-","AC Roma",0,":",0]
[null,null,null,null,null,null,278,9,35,"FC Barcelona","-","Eintracht Frankfurt",1,":",0]
[null,null,null,null,null,null,279,32,34,"VfB Stuttgart","-","Stade Brest",0,":",3]
[null,null,null,null,null,null,280,19,36,"Feyenoord Rotterdam","-","Mainz 05",5,":",1]
[null,null,null,null,null,null,281,3,7,"FC Bayern München","-","Borussia Dortmund",0,":",4]
[null,null,null,null,null,null,282,6,30,"Inter Mailand","-","FC Bologna",5,":",2]
[null,null,null,null,null,null,283,40,28,"Hertha BSC","-","AS Monaco",3,":",1]
[null,null,null,null,null,null,284,11,20,"Atletico Madrid","-","Sporting Lissabon",0,":",3]
[null,null,null,null,null,null,285,1,5,"Real Madrid","-","FC Liverpool",9,":",2]
[null,null,null,null,null,null,286,13,12,"Juventus Turin","-","Atalanta Bergamo",2,":",1]
[null,null,null,null,null,null,287,15,2,"FC Arsenal","-","Manchester City",1,":",3]
[null,null,null,null,null,null,288,39,23,"FC Lille","-","Dinamo Zagreb",2,":",0]
[null,null,null,null,null,null,289,16,21,"FC Brügge","-","PSV Eindhoven",0,":",0]
[null,null,null,null,null,null,290,10,17,"Bayer Leverkusen","-","Schachtjor Donezk",3,":",0]
[null,null,null,null,null,null,291,18,27,"AC Mailand","-","Young Boys Bern",0,":",0]
[null,null,null,null,null,null,292,26,24,"Roter Stern Belgrad","-","Red Bull Salzburg",1,":",0]
[null,null,null,null,null,null,293,25,22,"OSC Lille","-","Celtic Glasgow",0,":",3]
[null,null,null,null,null,null,294,14,29,"Benfica Lissabon","-","Aston Villa",5,":",1]
[null,null,null,null,null,null,295,31,38,"FC Girona","-","FC Basel",0,":",4]
[null,null,null,null,null,null,296,37,4,"AC Roma","-","Paris Saint-Germain",5,":",2]
[null,null,null,null,null,null,297,8,9,"RB Leipzig","-","FC Barcelona",3,":",1]
[null,null,null,null,null,null,298,34,33,"Stade Brest","-","Sturm Graz",0,":",3]
[null,null,null,null,null,null,299,35,19,"Eintracht Frankfurt","-","Feyenoord Rotterdam",9,":",2]
[null,null,null,null,null,null,300,36,32,"Mainz 05","-","VfB Stuttgart",3,":",1]
[null,null,null,null,null,null,301,6,3,"Inter Mailand","-","FC Bayern München",1,":",3]
[null,null,null,null,null,null,302,28,7,"AS Monaco","-","Borussia Dortmund",2,":",0]
[null,null,null,null,null,null,303,30,11,"FC Bologna","-","Atletico Madrid",0,":",0]
[null,null,null,null,null,null,304,5,40,"FC Liverpool","-","Hertha BSC",3,":",0]
[null,null,null,null,null,null,305,20,13,"Sporting Lissabon","-","Juventus Turin",0,":",0]
[null,null,null,null,null,null,306,2,1,"Manchester City","-","Real Madrid",1,":",0]
[null,null,null,null,null,null,307,12,39,"Atalanta Bergamo","-","FC Lille",0,":",3]
[null,null,null,null,null,null,308,21,15,"PSV Eindhoven","-","FC Arsenal",5,":",1]
[null,null,null,null,null,null,309,23,10,"Dinamo Zagreb","-","Bayer Leverkusen",0,":",4]
[null,null,null,null,null,null,310,27,16,"Young Boys Bern","-","FC Brügge",5,":",2]
[null,null,null,null,null,null,311,17,26,"Schachtjor Donezk","-","Roter Stern Belgrad",1,":",3]
[null,null,null,null,null,null,312,22,18,"Celtic Glasgow","-","AC Mailand",3,":",1]
[null,null,null,null,null,null,313,24,14,"Red Bull Salzburg","-","Benfica Lissabon",0,":",2]
[null,null,null,null,null,null,314,38,25,"FC Basel","-","OSC Lille",0,":",0]
[null,null,null,null,null,null,315,29,37,"Aston Villa","-","AC Roma",0,":",3]
[null,null,null,null,null,null,316,9,31,"FC Barcelona","-","FC Girona",0,":",0]
[null,null,null,null,null,null,317,4,34,"Paris Saint-Germain","-","Stade Brest",0,":",1]
[null,null,null,null,null,null,318,19,8,"Feyenoord Rotterdam","-","RB Leipzig",3,":",0]
[null,null,null,null,null,null,319,33,36,"Sturm Graz","-","Mainz 05",1,":",5]
[null,null,null,null,null,null,320,32,35,"VfB Stuttgart","-","Eintracht Frankfurt",4,":",0]
[null,null,null,null,null,null,321,3,28,"FC Bayern München","-","AS Monaco",2,":",5]
[null,null,null,null,null,null,322,11,6,{"$f":"IFERROR(VLOOKUP($H327,$B$6:$C$45,2,0),\"\")","v":"Atletico Madrid"},"-",{"$f":"IFERROR(VLOOKUP($I327,$B$6:$C$45,2,0),\"\")","v":"Inter Mailand"},1,":",3]
[null,null,null,null,null,null,323,7,5,"Borussia Dortmund","-","FC Liverpool",3,":",0]
[null,null,null,null,null,null,324,13,30,"Juventus Turin","-","FC Bologna",2,":",9]
[null,null,null,null,null,null,325,40,2,"Hertha BSC","-","Manchester City",1,":",3]
[null,null,null,null,null,null,326,39,20,"FC Lille","-","Sporting Lissabon",3,":",1]
[null,null,null,null,null,null,327,1,21,"Real Madrid","-","PSV Eindhoven",0,":",2]
[null,null,null,null,null,null,328,10,12,"Bayer Leverkusen","-","Atalanta Bergamo",0,":",0]
[null,null,null,null,null,null,329,15,27,"FC Arsenal","-","Young Boys Bern",0,":",3]
[null,null,null,null,null,null,330,26,23,"Roter Stern Belgrad","-","Dinamo Zagreb",0,":",0]
[null,null,null,null,null,null,331,16,22,"FC Brügge","-","Celtic Glasgow",0,":",1]
[null,null,null,null,null,null,332,14,17,"Benfica Lissabon","-","Schachtjor Donezk",3,":",0]
[null,null,null,null,null,null,333,18,38,"AC Mailand","-","FC Basel",1,":",5]
[null,null,null,null,null,null,334,37,24,"AC Roma","-","Red Bull Salzburg",4,":",0]
[null,null,null,null,null,null,335,25,9,"OSC Lille","-","FC Barcelona",2,":",5]
[null,null,null,null,null,null,336,34,29,"Stade Brest","-","Aston Villa",3,":",1]
[null,null,null,null,null,null,337,31,19,"FC Girona","-","Feyenoord Rotterdam",0,":",3]
[null,null,null,null,null,null,338,36,4,"Mainz 05","-","Paris Saint-Germain",9,":",2]
[null,null,null,null,null,null,339,8,32,"RB Leipzig","-","VfB Stuttgart",3,":",1]
[null,null,null,null,null,null,340,35,33,"Eintracht Frankfurt","-","Sturm Graz",1,":",3]
[null,null,null,null,null,null,341,11,3,"Atletico Madrid","-","FC Bayern München",2,":",0]
[null,null,null,null,null,null,342,5,28,"FC Liverpool","-","AS Monaco",0,":",0]
[null,null,null,null,null,null,343,6,13,"Inter Mailand","-","Juventus Turin",3,":",0]
[null,null,null,null,null,null,344,2,7,"Manchester City","-","Borussia Dortmund",0,":",0]
[null,null,null,null,null,null,345,30,39,"FC Bologna","-","FC Lille",1,":",0]
[null,null,null,null,null,null,346,21,40,"PSV Eindhoven","-","Hertha BSC",0,":",3]
[null,null,null,null,null,null,347,20,10,"Sporting Lissabon","-","Bayer Leverkusen",5,":",1]
[null,null,null,null,null,null,348,27,1,"Young Boys Bern","-","Real Madrid",0,":",4]
[null,null,null,null,null,null,349,12,26,"Atalanta Bergamo","-","Roter Stern Belgrad",5,":",2]
[null,null,null,null,null,null,350,22,15,"Celtic Glasgow","-","FC Arsenal",3,":",1]
[null,null,null,null,null,null,351,23,14,"Dinamo Zagreb","-","Benfica Lissabon",0,":",3]
[null,null,null,null,null,null,352,38,16,"FC Basel","-","FC Brügge",9,":",2]
[null,null,null,null,null,null,353,17,37,"Schachtjor Donezk","-","AC Roma",2,":",1]
[null,null,null,null,null,null,354,9,18,"FC Barcelona","-","AC Mailand",1,":",3]
[null,null,null,null,null,null,355,24,34,"Red Bull Salzburg","-","Stade Brest",2,":",0]
[null,null,null,null,null,null,356,19,25,"Feyenoord Rotterdam","-","OSC Lille",0,":",0]
[null,null,null,null,null,null,357,29,36,"Aston Villa","-","Mainz 05",3,":",0]
[null,null,null,null,null,null,358,32,31,"VfB Stuttgart","-","FC Girona",0,":",0]
[null,null,null,null,null,null,359,4,35,"Paris Saint-Germain","-","Eintracht Frankfurt",1,":",0]
[null,null,null,null,null,null,360,33,8,"Sturm Graz","-","RB Leipzig",0,":",3]
[null,null,null,null,null,null,361,3,5,"FC Bayern München","-","FC Liverpool",5,":",1]
[null,null,null,null,null,null,362,13,11,"Juventus Turin","-","Atletico Madrid",0,":",4]
[null,null,null,null,null,null,363,28,2,"AS Monaco","-","Manchester City",5,":",2]
[null,null,null,null,null,null,364,39,6,"FC Lille","-","Inter Mailand",3,":",1]
[null,null,null,null,null,null,365,7,21,"Borussia Dortmund","-","PSV Eindhoven",0,":",3]
[null,null,null,null,null,null,366,10,30,"Bayer Leverkusen","-","FC Bologna",9,":",2]
[null,null,null,null,null,null,367,40,27,"Hertha BSC","-","Young Boys Bern",3,":",1]
[null,null,null,null,null,null,368,26,20,"Roter Stern Belgrad","-","Sporting Lissabon",1,":",3]
[null,null,null,null,null,null,369,1,22,"Real Madrid","-","Celtic Glasgow",2,":",0]
[null,null,null,null,null,null,370,14,12,"Benfica Lissabon","-","Atalanta Bergamo",0,":",0]
[null,null,null,null,null,null,371,15,38,"FC Arsenal","-","FC Basel",3,":",0]
[null,null,null,null,null,null,372,37,23,"AC Roma","-","Dinamo Zagreb",0,":",0]
[null,null,null,null,null,null,373,16,9,"FC Brügge","-","FC Barcelona",1,":",0]
[null,null,null,null,null,null,374,34,17,"Stade Brest","-","Schachtjor Donezk",0,":",3]
[null,null,null,null,null,null,375,18,19,"AC Mailand","-","Feyenoord Rotterdam",5,":",1]
[null,null,null,null,null,null,376,36,24,"Mainz 05","-","Red Bull Salzburg",0,":",4]
[null,null,null,null,null,null,377,25,32,"OSC Lille","-","VfB Stuttgart",5,":",2]
[null,null,null,null,null,null,378,35,29,"Eintracht Frankfurt","-","Aston Villa",1,":",3]
[null,null,null,null,null,null,379,31,33,"FC Girona","-","Sturm Graz",3,":",1]
[null,null,null,null,null,null,380,8,4,"RB Leipzig","-","Paris Saint-Germain",0,":",2]
[null,null,null,null,null,null,381,13,3,"Juventus Turin","-","FC Bayern München",0,":",0]
[null,null,null,null,null,null,382,2,5,"Manchester City","-","FC Liverpool",0,":",3]
[null,null,null,null,null,null,383,11,39,"Atletico Madrid","-","FC Lille",0,":",0]
[null,null,null,null,null,null,384,21,28,"PSV Eindhoven","-","AS Monaco",0,":",1]
[null,null,null,null,null,null,385,6,10,"Inter Mailand","-","Bayer Leverkusen",3,":",0]
[null,null,null,null,null,null,386,27,7,{"$f":"IFERROR(VLOOKUP($H391,$B$6:$C$45,2,0),\"\")","v":"Young Boys Bern"},"-",{"$f":"IFERROR(VLOOKUP($I391,$B$6:$C$45,2,0),\"\")","v":"Borussia Dortmund"},1,":",5]
[null,null,null,null,null,null,387,30,26,"FC Bologna","-","Roter Stern Belgrad",4,":",0]
[null,null,null,null,null,null,388,22,40,"Celtic Glasgow","-","Hertha BSC",2,":",5]
[null,null,null,null,null,null,389,20,14,"Sporting Lissabon","-","Benfica Lissabon",1,":",3]
[null,null,null,null,null,null,390,38,1,"FC Basel","-","Real Madrid",3,":",0]
[null,null,null,null,null,null,391,12,37,"Atalanta Bergamo","-","AC Roma",2,":",9]
[null,null,null,null,null,null,392,9,15,"FC Barcelona","-","FC Arsenal",1,":",3]
[null,null,null,null,null,null,393,23,34,"Dinamo Zagreb","-","Stade Brest",3,":",1]
[null,null,null,null,null,null,394,19,16,"Feyenoord Rotterdam","-","FC Brügge",0,":",2]
[null,null,null,null,null,null,395,17,36,"Schachtjor Donezk","-","Mainz 05",0,":",0]
[null,null,null,null,null,null,396,32,18,"VfB Stuttgart","-","AC Mailand",0,":",3]
[null,null,null,null,null,null,397,24,35,"Red Bull Salzburg","-","Eintracht Frankfurt",0,":",0]
[null,null,null,null,null,null,398,33,25,"Sturm Graz","-","OSC Lille",0,":",1]
[null,null,null,null,null,null,399,29,8,"Aston Villa","-","RB Leipzig",3,":",0]
[null,null,null,null,null,null,400,4,31,"Paris Saint-Germain","-","FC Girona",1,":",5]
[null,null,null,null,null,null,401,3,2,"FC Bayern München","-","Manchester City",4,":",0]
[null,null,null,null,null,null,402,39,13,"FC Lille","-","Juventus Turin",2,":",5]
[null,null,null,null,null,null,403,5,21,"FC Liverpool","-","PSV Eindhoven",3,":",1]
[null,null,null,null,null,null,404,10,11,"Bayer Leverkusen","-","Atletico Madrid",0,":",3]
[null,null,null,null,null,null,405,28,27,"AS Monaco","-","Young Boys Bern",9,":",2]
[null,null,null,null,null,null,406,26,6,"Roter Stern Belgrad","-","Inter Mailand",3,":",1]
[null,null,null,null,null,null,407,7,22,"Borussia Dortmund","-","Celtic Glasgow",1,":",3]
[null,null,null,null,null,null,408,14,30,"Benfica Lissabon","-","FC Bologna",2,":",0]
[null,null,null,null,null,null,409,40,38,"Hertha BSC","-","FC Basel",0,":",0]
[null,null,null,null,null,null,410,37,20,"AC Roma","-","Sporting Lissabon",3,":",0]
[null,null,null,null,null,null,411,1,9,"Real Madrid","-","FC Barcelona",0,":",0]
[null,null,null,null,null,null,412,34,12,"Stade Brest","-","Atalanta Bergamo",1,":",0]
[null,null,null,null,null,null,413,15,19,"FC Arsenal","-","Feyenoord Rotterdam",0,":",3]
[null,null,null,null,null,null,414,36,23,"Mainz 05","-","Dinamo Zagreb",5,":",1]
[null,null,null,null,null,null,415,16,32,"FC Brügge","-","VfB Stuttgart",0,":",4]
[null,null,null,null,null,null,416,35,17,"Eintracht Frankfurt","-","Schachtjor Donezk",5,":",2]
[null,null,null,null,null,null,417,18,33,"AC Mailand","-","Sturm Graz",3,":",1]
[null,null,null,null,null,null,418,8,24,"RB Leipzig","-","Red Bull Salzburg",0,":",3]
[null,null,null,null,null,null,419,25,4,"OSC Lille","-","Paris Saint-Germain",9,":",2]
[null,null,null,null,null,null,420,31,29,"FC Girona","-","Aston Villa",2,":",1]
[null,null,null,null,null,null,421,39,3,"FC Lille","-","FC Bayern München",1,":",3]
[null,null,null,null,null,null,422,21,2,"PSV Eindhoven","-","Manchester City",2,":",0]
[null,null,null,null,null,null,423,13,10,"Juventus Turin","-","Bayer Leverkusen",0,":",0]
[null,null,null,null,null,null,424,27,5,"Young Boys Bern","-","FC Liverpool",3,":",0]
[null,null,null,null,null,null,425,11,26,"Atletico Madrid","-","Roter Stern Belgrad",0,":",0]
[null,null,null,null,null,null,426,22,28,"Celtic Glasgow","-","AS Monaco",1,":",0]
[null,null,null,null,null,null,427,6,14,"Inter Mailand","-","Benfica Lissabon",0,":",3]
[null,null,null,null,null,null,428,38,7,"FC Basel","-","Borussia Dortmund",5,":",1]
[null,null,null,null,null,null,429,30,37,"FC Bologna","-","AC Roma",0,":",4]
[null,null,null,null,null,null,430,9,40,"FC Barcelona","-","Hertha BSC",5,":",2]
[null,null,null,null,null,null,431,20,34,"Sporting Lissabon","-","Stade Brest",3,":",1]
[null,null,null,null,null,null,432,19,1,"Feyenoord Rotterdam","-","Real Madrid",0,":",3]
[null,null,null,null,null,null,433,12,36,"Atalanta Bergamo","-","Mainz 05",9,":",2]
[null,null,null,null,null,null,434,32,15,"VfB Stuttgart","-","FC Arsenal",3,":",1]
[null,null,null,null,null,null,435,23,35,"Dinamo Zagreb","-","Eintracht Frankfurt",1,":",3]
[null,null,null,null,null,null,436,33,16,"Sturm Graz","-","FC Brügge",2,":",0]
[null,null,null,null,null,null,437,17,8,"Schachtjor Donezk","-","RB Leipzig",0,":",0]
[null,null,null,null,null,null,438,4,18,"Paris Saint-Germain","-","AC Mailand",3,":",0]
[null,null,null,null,null,null,439,24,31,"Red Bull Salzburg","-","FC Girona",0,":",0]
[null,null,null,null,null,null,440,29,25,"Aston Villa","-","OSC Lille",1,":",0]
[null,null,null,null,null,null,441,3,21,"FC Bayern München","-","PSV Eindhoven",0,":",3]
[null,null,null,null,null,null,442,10,39,"Bayer Leverkusen","-","FC Lille",5,":",1]
[null,null,null,null,null,null,443,2,27,"Manchester City","-","Young Boys Bern",0,":",4]
[null,null,null,null,null,null,444,26,13,"Roter Stern Belgrad","-","Juventus Turin",5,":",2]
[null,null,null,null,null,null,445,5,22,"FC Liverpool","-","Celtic Glasgow",1,":",3]
[null,null,null,null,null,null,446,14,11,"Benfica Lissabon","-","Atletico Madrid",3,":",1]
[null,null,null,null,null,null,447,28,38,"AS Monaco","-","FC Basel",0,":",2]
[null,null,null,null,null,null,448,37,6,"AC Roma","-","Inter Mailand",0,":",0]
[null,null,null,null,null,null,449,7,9,"Borussia Dortmund","-","FC Barcelona",0,":",3]
[null,null,null,null,null,null,450,34,30,{"$f":"IFERROR(VLOOKUP($H455,$B$6:$C$45,2,0),\"\")","v":"Stade Brest"},"-",{"$f":"IFERROR(VLOOKUP($I455,$B$6:$C$45,2,0),\"\")","v":"FC Bologna"},0,":",0]
[null,null,null,null,null,null,451,40,19,"Hertha BSC","-","Feyenoord Rotterdam",0,":",1]
[null,null,null,null,null,null,452,36,20,"Mainz 05","-","Sporting Lissabon",3,":",0]
[null,null,null,null,null,null,453,1,32,"Real Madrid","-","VfB Stuttgart",1,":",5]
[null,null,null,null,null,null,454,35,12,"Eintracht Frankfurt","-","Atalanta Bergamo",4,":",0]
[null,null,null,null,null,null,455,15,33,"FC Arsenal","-","Sturm Graz",2,":",5]
[null,null,null,null,null,null,456,8,23,"RB Leipzig","-","Dinamo Zagreb",1,":",3]
[null,null,null,null,null,null,457,16,4,"FC Brügge","-","Paris Saint-Germain",3,":",0]
[null,null,null,null,null,null,458,31,17,"FC Girona","-","Schachtjor Donezk",2,":",9]
[null,null,null,null,null,null,459,18,29,"AC Mailand","-","Aston Villa",1,":",3]
[null,null,null,null,null,null,460,25,24,"OSC Lille","-","Red Bull Salzburg",3,":",1]
[null,null,null,null,null,null,461,10,3,"Bayer Leverkusen","-","FC Bayern München",0,":",2]
[null,null,null,null,null,null,462,27,21,"Young Boys Bern","-","PSV Eindhoven",0,":",0]
[null,null,null,null,null,null,463,39,26,"FC Lille","-","Roter Stern Belgrad",0,":",3]
[null,null,null,null,null,null,464,22,2,"Celtic Glasgow","-","Manchester City",0,":",0]
[null,null,null,null,null,null,465,13,14,"Juventus Turin","-","Benfica Lissabon",0,":",1]
[null,null,null,null,null,null,466,38,5,"FC Basel","-","FC Liverpool",3,":",0]
[null,null,null,null,null,null,467,11,37,"Atletico Madrid","-","AC Roma",1,":",5]
[null,null,null,null,null,null,468,9,28,"FC Barcelona","-","AS Monaco",4,":",0]
[null,null,null,null,null,null,469,6,34,"Inter Mailand","-","Stade Brest",2,":",5]
[null,null,null,null,null,null,470,19,7,"Feyenoord Rotterdam","-","Borussia Dortmund",3,":",1]
[null,null,null,null,null,null,471,30,36,"FC Bologna","-","Mainz 05",0,":",3]
[null,null,null,null,null,null,472,32,40,"VfB Stuttgart","-","Hertha BSC",9,":",2]
[null,null,null,null,null,null,473,20,35,"Sporting Lissabon","-","Eintracht Frankfurt",3,":",1]
[null,null,null,null,null,null,474,33,1,"Sturm Graz","-","Real Madrid",1,":",3]
[null,null,null,null,null,null,475,12,8,"Atalanta Bergamo","-","RB Leipzig",2,":",0]
[null,null,null,null,null,null,476,4,15,"Paris Saint-Germain","-","FC Arsenal",0,":",0]
[null,null,null,null,null,null,477,23,31,"Dinamo Zagreb","-","FC Girona",3,":",0]
[null,null,null,null,null,null,478,29,16,"Aston Villa","-","FC Brügge",0,":",0]
[null,null,null,null,null,null,479,17,25,"Schachtjor Donezk","-","OSC Lille",1,":",0]
[null,null,null,null,null,null,480,24,18,"Red Bull Salzburg","-","AC Mailand",0,":",3]
[null,null,null,null,null,null,481,3,27,"FC Bayern München","-","Young Boys Bern",5,":",1]
[null,null,null,null,null,null,482,26,10,"Roter Stern Belgrad","-","Bayer Leverkusen",0,":",4]
[null,null,null,null,null,null,483,21,22,"PSV Eindhoven","-","Celtic Glasgow",5,":",2]
[null,null,null,null,null,null,484,14,39,"Benfica Lissabon","-","FC Lille",3,":",1]
[null,null,null,null,null,null,485,2,38,"Manchester City","-","FC Basel",0,":",3]
[null,null,null,null,null,null,486,37,13,"AC Roma","-","Juventus Turin",9,":",2]
[null,null,null,null,null,null,487,5,9,"FC Liverpool","-","FC Barcelona",2,":",1]
[null,null,null,null,null,null,488,34,11,"Stade Brest","-","Atletico Madrid",1,":",3]
[null,null,null,null,null,null,489,28,19,"AS Monaco","-","Feyenoord Rotterdam",2,":",0]
[null,null,null,null,null,null,490,36,6,"Mainz 05","-","Inter Mailand",0,":",0]
[null,null,null,null,null,null,491,7,32,"Borussia Dortmund","-","VfB Stuttgart",3,":",0]
[null,null,null,null,null,null,492,35,30,"Eintracht Frankfurt","-","FC Bologna",0,":",0]
[null,null,null,null,null,null,493,40,33,"Hertha BSC","-","Sturm Graz",1,":",0]
[null,null,null,null,null,null,494,8,20,"RB Leipzig","-","Sporting Lissabon",0,":",3]
[null,null,null,null,null,null,495,1,4,"Real Madrid","-","Paris Saint-Germain",5,":",1]
[null,null,null,null,null,null,496,31,12,"FC Girona","-","Atalanta Bergamo",0,":",4]
[null,null,null,null,null,null,497,15,29,"FC Arsenal","-","Aston Villa",5,":",2]
[null,null,null,null,null,null,498,25,23,"OSC Lille","-","Dinamo Zagreb",3,":",1]
[null,null,null,null,null,null,499,16,24,"FC Brügge","-","Red Bull Salzburg",0,":",3]
[null,null,null,null,null,null,500,18,17,"AC Mailand","-","Schachtjor Donezk",9,":",2]
[null,null,null,null,null,null,501,26,3,"Roter Stern Belgrad","-","FC Bayern München",3,":",1]
[null,null,null,null,null,null,502,22,27,"Celtic Glasgow","-","Young Boys Bern",1,":",3]
[null,null,null,null,null,null,503,10,14,"Bayer Leverkusen","-","Benfica Lissabon",2,":",0]
[null,null,null,null,null,null,504,38,21,"FC Basel","-","PSV Eindhoven",0,":",0]
[null,null,null,null,null,null,505,39,37,"FC Lille","-","AC Roma",3,":",0]
[null,null,null,null,null,null,506,9,2,"FC Barcelona","-","Manchester City",0,":",0]
[null,null,null,null,null,null,507,13,34,"Juventus Turin","-","Stade Brest",1,":",0]
[null,null,null,null,null,null,508,19,5,"Feyenoord Rotterdam","-","FC Liverpool",0,":",3]
[null,null,null,null,null,null,509,11,36,"Atletico Madrid","-","Mainz 05",5,":",1]
[null,null,null,null,null,null,510,32,28,"VfB Stuttgart","-","AS Monaco",0,":",4]
[null,null,null,null,null,null,511,6,35,"Inter Mailand","-","Eintracht Frankfurt",5,":",2]
[null,null,null,null,null,null,512,33,7,"Sturm Graz","-","Borussia Dortmund",1,":",3]
[null,null,null,null,null,null,513,30,8,"FC Bologna","-","RB Leipzig",3,":",1]
[null,null,null,null,null,null,514,4,40,{"$f":"IFERROR(VLOOKUP($H519,$B$6:$C$45,2,0),\"\")","v":"Paris Saint-Germain"},"-",{"$f":"IFERROR(VLOOKUP($I519,$B$6:$C$45,2,0),\"\")","v":"Hertha BSC"},0,":",2]
[null,null,null,null,null,null,515,20,31,"Sporting Lissabon","-","FC Girona",0,":",0]
[null,null,null,null,null,null,516,29,1,"Aston Villa","-","Real Madrid",0,":",3]
[null,null,null,null,null,null,517,12,25,"Atalanta Bergamo","-","OSC Lille",0,":",0]
[null,null,null,null,null,null,518,24,15,"Red Bull Salzburg","-","FC Arsenal",0,":",1]
[null,null,null,null,null,null,519,23,18,"Dinamo Zagreb","-","AC Mailand",3,":",0]
[null,null,null,null,null,null,520,17,16,"Schachtjor Donezk","-","FC Brügge",1,":",5]
[null,null,null,null,null,null,521,3,22,"FC Bayern München","-","Celtic Glasgow",4,":",0]
[null,null,null,null,null,null,522,14,26,"Benfica Lissabon","-","Roter Stern Belgrad",2,":",5]
[null,null,null,null,null,null,523,27,38,"Young Boys Bern","-","FC Basel",1,":",3]
[null,null,null,null,null,null,524,37,10,"AC Roma","-","Bayer Leverkusen",3,":",0]
[null,null,null,null,null,null,525,21,9,"PSV Eindhoven","-","FC Barcelona",2,":",9]
[null,null,null,null,null,null,526,34,39,"Stade Brest","-","FC Lille",1,":",3]
[null,null,null,null,null,null,527,2,19,"Manchester City","-","Feyenoord Rotterdam",3,":",1]
[null,null,null,null,null,null,528,36,13,"Mainz 05","-","Juventus Turin",0,":",2]
[null,null,null,null,null,null,529,5,32,"FC Liverpool","-","VfB Stuttgart",0,":",0]
[null,null,null,null,null,null,530,35,11,"Eintracht Frankfurt","-","Atletico Madrid",0,":",3]
[null,null,null,null,null,null,531,28,33,"AS Monaco","-","Sturm Graz",0,":",0]
[null,null,null,null,null,null,532,8,6,"RB Leipzig","-","Inter Mailand",0,":",1]
[null,null,null,null,null,null,533,7,4,"Borussia Dortmund","-","Paris Saint-Germain",3,":",0]
[null,null,null,null,null,null,534,31,30,"FC Girona","-","FC Bologna",1,":",5]
[null,null,null,null,null,null,535,40,29,"Hertha BSC","-","Aston Villa",4,":",0]
[null,null,null,null,null,null,536,25,20,"OSC Lille","-","Sporting Lissabon",2,":",5]
[null,null,null,null,null,null,537,1,24,"Real Madrid","-","Red Bull Salzburg",3,":",1]
[null,null,null,null,null,null,538,18,12,"AC Mailand","-","Atalanta Bergamo",0,":",3]
[null,null,null,null,null,null,539,15,17,"FC Arsenal","-","Schachtjor Donezk",9,":",2]
[null,null,null,null,null,null,540,16,23,"FC Brügge","-","Dinamo Zagreb",3,":",1]
[null,null,null,null,null,null,541,14,3,"Benfica Lissabon","-","FC Bayern München",1,":",3]
[null,null,null,null,null,null,542,38,22,"FC Basel","-","Celtic Glasgow",2,":",0]
[null,null,null,null,null,null,543,26,37,"Roter Stern Belgrad","-","AC Roma",0,":",0]
[null,null,null,null,null,null,544,9,27,"FC Barcelona","-","Young Boys Bern",3,":",0]
[null,null,null,null,null,null,545,10,34,"Bayer Leverkusen","-","Stade Brest",0,":",0]
[null,null,null,null,null,null,546,19,21,"Feyenoord Rotterdam","-","PSV Eindhoven",1,":",0]
[null,null,null,null,null,null,547,39,36,"FC Lille","-","Mainz 05",0,":",3]
[null,null,null,null,null,null,548,32,2,"VfB Stuttgart","-","Manchester City",5,":",1]
[null,null,null,null,null,null,549,13,35,"Juventus Turin","-","Eintracht Frankfurt",0,":",4]
[null,null,null,null,null,null,550,33,5,"Sturm Graz","-","FC Liverpool",5,":",2]
[null,null,null,null,null,null,551,11,8,"Atletico Madrid","-","RB Leipzig",3,":",1]
[null,null,null,null,null,null,552,4,28,"Paris Saint-Germain","-","AS Monaco",0,":",3]
[null,null,null,null,null,null,553,6,31,"Inter Mailand","-","FC Girona",9,":",2]
[null,null,null,null,null,null,554,29,7,"Aston Villa","-","Borussia Dortmund",2,":",1]
[null,null,null,null,null,null,555,30,25,"FC Bologna","-","OSC Lille",1,":",3]
[null,null,null,null,null,null,556,24,40,"Red Bull Salzburg","-","Hertha BSC",2,":",0]
[null,null,null,null,null,null,557,20,18,"Sporting Lissabon","-","AC Mailand",0,":",0]
[null,null,null,null,null,null,558,17,1,"Schachtjor Donezk","-","Real Madrid",3,":",0]
[null,null,null,null,null,null,559,12,16,"Atalanta Bergamo","-","FC Brügge",0,":",0]
[null,null,null,null,null,null,560,23,15,"Dinamo Zagreb","-","FC Arsenal",1,":",0]
[null,null,null,null,null,null,561,3,38,"FC Bayern München","-","FC Basel",0,":",3]
[null,null,null,null,null,null,562,37,14,"AC Roma","-","Benfica Lissabon",5,":",1]
[null,null,null,null,null,null,563,22,9,"Celtic Glasgow","-","FC Barcelona",0,":",4]
[null,null,null,null,null,null,564,34,26,"Stade Brest","-","Roter Stern Belgrad",5,":",2]
[null,null,null,null,null,null,565,27,19,"Young Boys Bern","-","Feyenoord Rotterdam",3,":",1]
[null,null,null,null,null,null,566,36,10,"Mainz 05","-","Bayer Leverkusen",0,":",3]
[null,null,null,null,null,null,567,21,32,"PSV Eindhoven","-","VfB Stuttgart",9,":",2]
[null,null,null,null,null,null,568,35,39,"Eintracht Frankfurt","-","FC Lille",3,":",1]
[null,null,null,null,null,null,569,2,33,"Manchester City","-","Sturm Graz",1,":",3]
[null,null,null,null,null,null,570,8,13,"RB Leipzig","-","Juventus Turin",2,":",0]
[null,null,null,null,null,null,571,5,4,"FC Liverpool","-","Paris Saint-Germain",0,":",0]
[null,null,null,null,null,null,572,31,11,"FC Girona","-","Atletico Madrid",3,":",0]
[null,null,null,null,null,null,573,28,29,"AS Monaco","-","Aston Villa",0,":",0]
[null,null,null,null,null,null,574,25,6,"OSC Lille","-","Inter Mailand",1,":",0]
[null,null,null,null,null,null,575,7,24,"Borussia Dortmund","-","Red Bull Salzburg",0,":",3]
[null,null,null,null,null,null,576,18,30,"AC Mailand","-","FC Bologna",5,":",1]
[null,null,null,null,null,null,577,40,17,"Hertha BSC","-","Schachtjor Donezk",0,":",4]
[null,null,null,null,null,null,578,16,20,{"$f":"IFERROR(VLOOKUP($H583,$B$6:$C$45,2,0),\"\")","v":"FC Brügge"},"-",{"$f":"IFERROR(VLOOKUP($I583,$B$6:$C$45,2,0),\"\")","v":"Sporting Lissabon"},5,":",2]
[null,null,null,null,null,null,579,1,23,"Real Madrid","-","Dinamo Zagreb",1,":",3]
[null,null,null,null,null,null,580,15,12,"FC Arsenal","-","Atalanta Bergamo",3,":",1]
[null,null,null,null,null,null,581,37,3,"AC Roma","-","FC Bayern München",0,":",2]
[null,null,null,null,null,null,582,9,38,"FC Barcelona","-","FC Basel",0,":",0]
[null,null,null,null,null,null,583,14,34,"Benfica Lissabon","-","Stade Brest",0,":",3]
[null,null,null,null,null,null,584,19,22,"Feyenoord Rotterdam","-","Celtic Glasgow",0,":",0]
[null,null,null,null,null,null,585,26,36,"Roter Stern Belgrad","-","Mainz 05",0,":",1]
[null,null,null,null,null,null,586,32,27,"VfB Stuttgart","-","Young Boys Bern",3,":",0]
[null,null,null,null,null,null,587,10,35,"Bayer Leverkusen","-","Eintracht Frankfurt",1,":",5]
[null,null,null,null,null,null,588,33,21,"Sturm Graz","-","PSV Eindhoven",4,":",0]
[null,null,null,null,null,null,589,39,8,"FC Lille","-","RB Leipzig",2,":",5]
[null,null,null,null,null,null,590,4,2,"Paris Saint-Germain","-","Manchester City",1,":",3]
[null,null,null,null,null,null,591,13,31,"Juventus Turin","-","FC Girona",3,":",0]
[null,null,null,null,null,null,592,29,5,"Aston Villa","-","FC Liverpool",2,":",9]
[null,null,null,null,null,null,593,11,25,"Atletico Madrid","-","OSC Lille",1,":",3]
[null,null,null,null,null,null,594,24,28,"Red Bull Salzburg","-","AS Monaco",3,":",1]
[null,null,null,null,null,null,595,6,18,"Inter Mailand","-","AC Mailand",0,":",2]
[null,null,null,null,null,null,596,17,7,"Schachtjor Donezk","-","Borussia Dortmund",0,":",0]
[null,null,null,null,null,null,597,30,16,"FC Bologna","-","FC Brügge",0,":",3]
[null,null,null,null,null,null,598,23,40,"Dinamo Zagreb","-","Hertha BSC",0,":",0]
[null,null,null,null,null,null,599,20,15,"Sporting Lissabon","-","FC Arsenal",0,":",1]
[null,null,null,null,null,null,600,12,1,"Atalanta Bergamo","-","Real Madrid",3,":",0]
[null,null,null,null,null,null,601,3,9,"FC Bayern München","-","FC Barcelona",1,":",5]
[null,null,null,null,null,null,602,34,37,"Stade Brest","-","AC Roma",4,":",0]
[null,null,null,null,null,null,603,38,19,"FC Basel","-","Feyenoord Rotterdam",2,":",5]
[null,null,null,null,null,null,604,36,14,"Mainz 05","-","Benfica Lissabon",3,":",1]
[null,null,null,null,null,null,605,22,32,"Celtic Glasgow","-","VfB Stuttgart",0,":",3]
[null,null,null,null,null,null,606,35,26,"Eintracht Frankfurt","-","Roter Stern Belgrad",9,":",2]
[null,null,null,null,null,null,607,27,33,"Young Boys Bern","-","Sturm Graz",3,":",1]
[null,null,null,null,null,null,608,8,10,"RB Leipzig","-","Bayer Leverkusen",1,":",3]
[null,null,null,null,null,null,609,21,4,"PSV Eindhoven","-","Paris Saint-Germain",2,":",0]
[null,null,null,null,null,null,610,31,39,"FC Girona","-","FC Lille",0,":",0]
[null,null,null,null,null,null,611,2,29,"Manchester City","-","Aston Villa",3,":",0]
[null,null,null,null,null,null,612,25,13,"OSC Lille","-","Juventus Turin",0,":",0]
[null,null,null,null,null,null,613,5,24,"FC Liverpool","-","Red Bull Salzburg",1,":",0]
[null,null,null,null,null,null,614,18,11,"AC Mailand","-","Atletico Madrid",0,":",3]
[null,null,null,null,null,null,615,28,17,"AS Monaco","-","Schachtjor Donezk",5,":",1]
[null,null,null,null,null,null,616,16,6,"FC Brügge","-","Inter Mailand",0,":",4]
[null,null,null,null,null,null,617,7,23,"Borussia Dortmund","-","Dinamo Zagreb",5,":",2]
[null,null,null,null,null,null,618,15,30,"FC Arsenal","-","FC Bologna",3,":",1]
[null,null,null,null,null,null,619,40,12,"Hertha BSC","-","Atalanta Bergamo",0,":",3]
[null,null,null,null,null,null,620,1,20,"Real Madrid","-","Sporting Lissabon",9,":",2]
[null,null,null,null,null,null,621,34,3,"Stade Brest","-","FC Bayern München",2,":",1]
[null,null,null,null,null,null,622,19,9,"Feyenoord Rotterdam","-","FC Barcelona",1,":",3]
[null,null,null,null,null,null,623,37,36,"AC Roma","-","Mainz 05",2,":",0]
[null,null,null,null,null,null,624,32,38,"VfB Stuttgart","-","FC Basel",0,":",0]
[null,null,null,null,null,null,625,14,35,"Benfica Lissabon","-","Eintracht Frankfurt",3,":",0]
[null,null,null,null,null,null,626,33,22,"Sturm Graz","-","Celtic Glasgow",0,":",0]
[null,null,null,null,null,null,627,26,8,"Roter Stern Belgrad","-","RB Leipzig",1,":",0]
[null,null,null,null,null,null,628,4,27,"Paris Saint-Germain","-","Young Boys Bern",0,":",3]
[null,null,null,null,null,null,629,10,31,"Bayer Leverkusen","-","FC Girona",5,":",1]
[null,null,null,null,null,null,630,29,21,"Aston Villa","-","PSV Eindhoven",0,":",4]
[null,null,null,null,null,null,631,39,25,"FC Lille","-","OSC Lille",5,":",2]
[null,null,null,null,null,null,632,24,2,"Red Bull Salzburg","-","Manchester City",3,":",1]
[null,null,null,null,null,null,633,13,18,"Juventus Turin","-","AC Mailand",0,":",3]
[null,null,null,null,null,null,634,17,5,"Schachtjor Donezk","-","FC Liverpool",9,":",2]
[null,null,null,null,null,null,635,11,16,"Atletico Madrid","-","FC Brügge",3,":",1]
[null,null,null,null,null,null,636,23,28,"Dinamo Zagreb","-","AS Monaco",1,":",3]
[null,null,null,null,null,null,637,6,15,"Inter Mailand","-","FC Arsenal",2,":",0]
[null,null,null,null,null,null,638,12,7,"Atalanta Bergamo","-","Borussia Dortmund",0,":",0]
[null,null,null,null,null,null,639,30,1,"FC Bologna","-","Real Madrid",3,":",0]
[null,null,null,null,null,null,640,20,40,"Sporting Lissabon","-","Hertha BSC",0,":",0]
[null,null,null,null,null,null,641,3,19,"FC Bayern München","-","Feyenoord Rotterdam",1,":",0]
[null,null,null,null,null,null,642,36,34,{"$f":"IFERROR(VLOOKUP($H647,$B$6:$C$45,2,0),\"\")","v":"Mainz 05"},"-",{"$f":"IFERROR(VLOOKUP($I647,$B$6:$C$45,2,0),\"\")","v":"Stade Brest"},0,":",3]
[null,null,null,null,null,null,643,9,32,"FC Barcelona","-","VfB Stuttgart",5,":",1]
[null,null,null,null,null,null,644,35,37,"Eintracht Frankfurt","-","AC Roma",0,":",4]
[null,null,null,null,null,null,645,38,33,"FC Basel","-","Sturm Graz",5,":",2]
[null,null,null,null,null,null,646,8,14,"RB Leipzig","-","Benfica Lissabon",1,":",3]
[null,null,null,null,null,null,647,22,4,"Celtic Glasgow","-","Paris Saint-Germain",3,":",1]
[null,null,null,null,null,null,648,31,26,"FC Girona","-","Roter Stern Belgrad",0,":",2]
[null,null,null,null,null,null,649,27,29,"Young Boys Bern","-","Aston Villa",0,":",0]
[null,null,null,null,null,null,650,25,10,"OSC Lille","-","Bayer Leverkusen",0,":",3]
[null,null,null,null,null,null,651,21,24,"PSV Eindhoven","-","Red Bull Salzburg",0,":",0]
[null,null,null,null,null,null,652,18,39,"AC Mailand","-","FC Lille",0,":",1]
[null,null,null,null,null,null,653,2,17,"Manchester City","-","Schachtjor Donezk",3,":",0]
[null,null,null,null,null,null,654,16,13,"FC Brügge","-","Juventus Turin",1,":",5]
[null,null,null,null,null,null,655,5,23,"FC Liverpool","-","Dinamo Zagreb",4,":",0]
[null,null,null,null,null,null,656,15,11,"FC Arsenal","-","Atletico Madrid",2,":",5]
[null,null,null,null,null,null,657,28,12,"AS Monaco","-","Atalanta Bergamo",1,":",3]
[null,null,null,null,null,null,658,1,6,"Real Madrid","-","Inter Mailand",3,":",0]
[null,null,null,null,null,null,659,7,20,"Borussia Dortmund","-","Sporting Lissabon",2,":",9]
[null,null,null,null,null,null,660,40,30,"Hertha BSC","-","FC Bologna",1,":",3]
[null,null,null,null,null,null,661,36,3,"Mainz 05","-","FC Bayern München",3,":",1]
[null,null,null,null,null,null,662,32,19,"VfB Stuttgart","-","Feyenoord Rotterdam",0,":",2]
[null,null,null,null,null,null,663,34,35,"Stade Brest","-","Eintracht Frankfurt",0,":",0]
[null,null,null,null,null,null,664,33,9,"Sturm Graz","-","FC Barcelona",0,":",3]
[null,null,null,null,null,null,665,37,8,"AC Roma","-","RB Leipzig",0,":",0]
[null,null,null,null,null,null,666,4,38,"Paris Saint-Germain","-","FC Basel",0,":",1]
[null,null,null,null,null,null,667,14,31,"Benfica Lissabon","-","FC Girona",3,":",0]
[null,null,null,null,null,null,668,29,22,"Aston Villa","-","Celtic Glasgow",1,":",5]
[null,null,null,null,null,null,669,26,25,"Roter Stern Belgrad","-","OSC Lille",4,":",0]
[null,null,null,null,null,null,670,24,27,"Red Bull Salzburg","-","Young Boys Bern",2,":",5]
[null,null,null,null,null,null,671,10,18,"Bayer Leverkusen","-","AC Mailand",3,":",1]
[null,null,null,null,null,null,672,17,21,"Schachtjor Donezk","-","PSV Eindhoven",0,":",3]
[null,null,null,null,null,null,673,39,16,"FC Lille","-","FC Brügge",9,":",2]
[null,null,null,null,null,null,674,23,2,"Dinamo Zagreb","-","Manchester City",3,":",1]
[null,null,null,null,null,null,675,13,15,"Juventus Turin","-","FC Arsenal",1,":",3]
[null,null,null,null,null,null,676,12,5,"Atalanta Bergamo","-","FC Liverpool",2,":",0]
[null,null,null,null,null,null,677,11,1,"Atletico Madrid","-","Real Madrid",0,":",0]
[null,null,null,null,null,null,678,20,28,"Sporting Lissabon","-","AS Monaco",3,":",0]
[null,null,null,null,null,null,679,6,40,"Inter Mailand","-","Hertha BSC",0,":",0]
[null,null,null,null,null,null,680,30,7,"FC Bologna","-","Borussia Dortmund",1,":",0]
[null,null,null,null,null,null,681,3,32,"FC Bayern München","-","VfB Stuttgart",0,":",3]
[null,null,null,null,null,null,682,35,36,"Eintracht Frankfurt","-","Mainz 05",5,":",1]
[null,null,null,null,null,null,683,19,33,"Feyenoord Rotterdam","-","Sturm Graz",0,":",4]
[null,null,null,null,null,null,684,8,34,"RB Leipzig","-","Stade Brest",5,":",2]
[null,null,null,null,null,null,685,9,4,"FC Barcelona","-","Paris Saint-Germain",3,":",1]
[null,null,null,null,null,null,686,31,37,"FC Girona","-","AC Roma",0,":",3]
[null,null,null,null,null,null,687,38,29,"FC Basel","-","Aston Villa",9,":",2]
[null,null,null,null,null,null,688,25,14,"OSC Lille","-","Benfica Lissabon",2,":",1]
[null,null,null,null,null,null,689,22,24,"Celtic Glasgow","-","Red Bull Salzburg",1,":",3]
[null,null,null,null,null,null,690,18,26,"AC Mailand","-","Roter Stern Belgrad",2,":",0]
[null,null,null,null,null,null,691,27,17,"Young Boys Bern","-","Schachtjor Donezk",0,":",0]
[null,null,null,null,null,null,692,16,10,"FC Brügge","-","Bayer Leverkusen",3,":",0]
[null,null,null,null,null,null,693,21,23,"PSV Eindhoven","-","Dinamo Zagreb",0,":",0]
[null,null,null,null,null,null,694,15,39,"FC Arsenal","-","FC Lille",1,":",0]
[null,null,null,null,null,null,695,2,12,"Manchester City","-","Atalanta Bergamo",0,":",3]
[null,null,null,null,null,null,696,1,13,"Real Madrid","-","Juventus Turin",5,":",1]
[null,null,null,null,null,null,697,5,20,"FC Liverpool","-","Sporting Lissabon",0,":",4]
[null,null,null,null,null,null,698,40,11,"Hertha BSC","-","Atletico Madrid",5,":",2]
[null,null,null,null,null,null,699,28,30,"AS Monaco","-","FC Bologna",3,":",1]
[null,null,null,null,null,null,700,7,6,"Borussia Dortmund","-","Inter Mailand",0,":",3]
[null,null,null,null,null,null,701,35,3,"Eintracht Frankfurt","-","FC Bayern München",9,":",2]
[null,null,null,null,null,null,702,33,32,"Sturm Graz","-","VfB Stuttgart",3,":",1]
[null,null,null,null,null,null,703,36,8,"Mainz 05","-","RB Leipzig",1,":",3]
[null,null,null,null,null,null,704,4,19,"Paris Saint-Germain","-","Feyenoord Rotterdam",2,":",0]
[null,null,null,null,null,null,705,34,31,"Stade Brest","-","FC Girona",0,":",0]
[null,null,null,null,null,null,706,29,9,{"$f":"IFERROR(VLOOKUP($H711,$B$6:$C$45,2,0),\"\")","v":"Aston Villa"},"-",{"$f":"IFERROR(VLOOKUP($I711,$B$6:$C$45,2,0),\"\")","v":"FC Barcelona"},3,":",0]
[null,null,null,null,null,null,707,37,25,"AC Roma","-","OSC Lille",0,":",0]
[null,null,null,null,null,null,708,24,38,"Red Bull Salzburg","-","FC Basel",1,":",0]
[null,null,null,null,null,null,709,14,18,"Benfica Lissabon","-","AC Mailand",0,":",3]
[null,null,null,null,null,null,710,17,22,"Schachtjor Donezk","-","Celtic Glasgow",5,":",1]
[null,null,null,null,null,null,711,26,16,"Roter Stern Belgrad","-","FC Brügge",0,":",4]
[null,null,null,null,null,null,712,23,27,"Dinamo Zagreb","-","Young Boys Bern",5,":",2]
[null,null,null,null,null,null,713,10,15,"Bayer Leverkusen","-","FC Arsenal",1,":",3]
[null,null,null,null,null,null,714,12,21,"Atalanta Bergamo","-","PSV Eindhoven",3,":",1]
[null,null,null,null,null,null,715,39,1,"FC Lille","-","Real Madrid",0,":",2]
[null,null,null,null,null,null,716,20,2,"Sporting Lissabon","-","Manchester City",0,":",0]
[null,null,null,null,null,null,717,13,40,"Juventus Turin","-","Hertha BSC",0,":",3]
[null,null,null,null,null,null,718,30,5,"FC Bologna","-","FC Liverpool",0,":",0]
[null,null,null,null,null,null,719,11,7,"Atletico Madrid","-","Borussia Dortmund",0,":",1]
[null,null,null,null,null,null,720,6,28,"Inter Mailand","-","AS Monaco",3,":",0]
[null,null,null,null,null,null,721,3,33,"FC Bayern München","-","Sturm Graz",1,":",5]
[null,null,null,null,null,null,722,8,35,"RB Leipzig","-","Eintracht Frankfurt",4,":",0]
[null,null,null,null,null,null,723,32,4,"VfB Stuttgart","-","Paris Saint-Germain",2,":",5]
[null,null,null,null,null,null,724,31,36,"FC Girona","-","Mainz 05",1,":",3]
[null,null,null,null,null,null,725,19,29,"Feyenoord Rotterdam","-","Aston Villa",3,":",0]
[null,null,null,null,null,null,726,25,34,"OSC Lille","-","Stade Brest",2,":",9]
[null,null,null,null,null,null,727,9,24,"FC Barcelona","-","Red Bull Salzburg",1,":",3]
[null,null,null,null,null,null,728,18,37,"AC Mailand","-","AC Roma",3,":",1]
[null,null,null,null,null,null,729,38,17,"FC Basel","-","Schachtjor Donezk",0,":",2]
[null,null,null,null,null,null,730,16,14,"FC Brügge","-","Benfica Lissabon",0,":",0]
[null,null,null,null,null,null,731,22,23,"Celtic Glasgow","-","Dinamo Zagreb",0,":",3]
[null,null,null,null,null,null,732,15,26,"FC Arsenal","-","Roter Stern Belgrad",0,":",0]
[null,null,null,null,null,null,733,27,12,"Young Boys Bern","-","Atalanta Bergamo",0,":",1]
[null,null,null,null,null,null,734,1,10,"Real Madrid","-","Bayer Leverkusen",3,":",0]
[null,null,null,null,null,null,735,21,20,"PSV Eindhoven","-","Sporting Lissabon",1,":",5]
[null,null,null,null,null,null,736,40,39,"Hertha BSC","-","FC Lille",4,":",0]
[null,null,null,null,null,null,737,2,30,"Manchester City","-","FC Bologna",2,":",5]
[null,null,null,null,null,null,738,7,13,"Borussia Dortmund","-","Juventus Turin",3,":",1]
[null,null,null,null,null,null,739,5,6,"FC Liverpool","-","Inter Mailand",0,":",3]
[null,null,null,null,null,null,740,28,11,"AS Monaco","-","Atletico Madrid",9,":",2]
[null,null,null,null,null,null,741,8,3,"RB Leipzig","-","FC Bayern München",3,":",1]
[null,null,null,null,null,null,742,4,33,"Paris Saint-Germain","-","Sturm Graz",1,":",3]
[null,null,null,null,null,null,743,35,31,"Eintracht Frankfurt","-","FC Girona",2,":",0]
[null,null,null,null,null,null,744,29,32,"Aston Villa","-","VfB Stuttgart",0,":",0]
[null,null,null,null,null,null,745,36,25,"Mainz 05","-","OSC Lille",3,":",0]
[null,null,null,null,null,null,746,24,19,"Red Bull Salzburg","-","Feyenoord Rotterdam",0,":",0]
[null,null,null,null,null,null,747,34,18,"Stade Brest","-","AC Mailand",1,":",0]
[null,null,null,null,null,null,748,17,9,"Schachtjor Donezk","-","FC Barcelona",0,":",3]
[null,null,null,null,null,null,749,37,16,"AC Roma","-","FC Brügge",5,":",1]
[null,null,null,null,null,null,750,23,38,"Dinamo Zagreb","-","FC Basel",0,":",4]
[null,null,null,null,null,null,751,14,15,"Benfica Lissabon","-","FC Arsenal",5,":",2]
[null,null,null,null,null,null,752,12,22,"Atalanta Bergamo","-","Celtic Glasgow",3,":",1]
[null,null,null,null,null,null,753,26,1,"Roter Stern Belgrad","-","Real Madrid",0,":",3]
[null,null,null,null,null,null,754,20,27,"Sporting Lissabon","-","Young Boys Bern",9,":",2]
[null,null,null,null,null,null,755,10,40,"Bayer Leverkusen","-","Hertha BSC",2,":",1]
[null,null,null,null,null,null,756,30,21,"FC Bologna","-","PSV Eindhoven",1,":",3]
[null,null,null,null,null,null,757,39,7,"FC Lille","-","Borussia Dortmund",2,":",0]
[null,null,null,null,null,null,758,6,2,"Inter Mailand","-","Manchester City",0,":",0]
[null,null,null,null,null,null,759,13,28,"Juventus Turin","-","AS Monaco",3,":",0]
[null,null,null,null,null,null,760,11,5,"Atletico Madrid","-","FC Liverpool",0,":",0]
[null,null,null,null,null,null,761,3,4,"FC Bayern München","-","Paris Saint-Germain",1,":",0]
[null,null,null,null,null,null,762,31,8,"FC Girona","-","RB Leipzig",0,":",3]
[null,null,null,null,null,null,763,33,29,"Sturm Graz","-","Aston Villa",5,":",1]
[null,null,null,null,null,null,764,25,35,"OSC Lille","-","Eintracht Frankfurt",0,":",4]
[null,null,null,null,null,null,765,32,24,"VfB Stuttgart","-","Red Bull Salzburg",5,":",2]
[null,null,null,null,null,null,766,18,36,"AC Mailand","-","Mainz 05",3,":",1]
[null,null,null,null,null,null,767,19,17,"Feyenoord Rotterdam","-","Schachtjor Donezk",0,":",3]
[null,null,null,null,null,null,768,16,34,"FC Brügge","-","Stade Brest",9,":",2]
[null,null,null,null,null,null,769,9,23,"FC Barcelona","-","Dinamo Zagreb",3,":",1]
[null,null,null,null,null,null,770,15,37,{"$f":"IFERROR(VLOOKUP($H775,$B$6:$C$45,2,0),\"\")","v":"FC Arsenal"},"-",{"$f":"IFERROR(VLOOKUP($I775,$B$6:$C$45,2,0),\"\")","v":"AC Roma"},1,":",3]
[null,null,null,null,null,null,771,38,12,"FC Basel","-","Atalanta Bergamo",2,":",0]
[null,null,null,null,null,null,772,1,14,"Real Madrid","-","Benfica Lissabon",0,":",0]
[null,null,null,null,null,null,773,22,20,"Celtic Glasgow","-","Sporting Lissabon",3,":",0]
[null,null,null,null,null,null,774,40,26,"Hertha BSC","-","Roter Stern Belgrad",0,":",0]
[null,null,null,null,null,null,775,27,30,"Young Boys Bern","-","FC Bologna",1,":",0]
[null,null,null,null,null,null,776,7,10,"Borussia Dortmund","-","Bayer Leverkusen",0,":",3]
[null,null,null,null,null,null,777,21,6,"PSV Eindhoven","-","Inter Mailand",5,":",1]
[null,null,null,null,null,null,778,28,39,"AS Monaco","-","FC Lille",0,":",4]
[null,null,null,null,null,null,779,2,11,"Manchester City","-","Atletico Madrid",5,":",2]
[null,null,null,null,null,null,780,5,13,"FC Liverpool","-","Juventus Turin",1,":",3]
[null,null,null,null,null,null,781,31,3,"FC Girona","-","FC Bayern München",3,":",1]
[null,null,null,null,null,null,782,4,29,"Paris Saint-Germain","-","Aston Villa",0,":",2]
[null,null,null,null,null,null,783,25,8,"OSC Lille","-","RB Leipzig",0,":",0]
[null,null,null,null,null,null,784,33,24,"Sturm Graz","-","Red Bull Salzburg",0,":",3]
[null,null,null,null,null,null,785,18,35,"AC Mailand","-","Eintracht Frankfurt",0,":",0]
[null,null,null,null,null,null,786,32,17,"VfB Stuttgart","-","Schachtjor Donezk",0,":",1]
[null,null,null,null,null,null,787,16,36,"FC Brügge","-","Mainz 05",3,":",0]
[null,null,null,null,null,null,788,19,23,"Feyenoord Rotterdam","-","Dinamo Zagreb",1,":",5]
[null,null,null,null,null,null,789,15,34,"FC Arsenal","-","Stade Brest",4,":",0]
[null,null,null,null,null,null,790,9,12,"FC Barcelona","-","Atalanta Bergamo",2,":",5]
[null,null,null,null,null,null,791,1,37,"Real Madrid","-","AC Roma",1,":",3]
[null,null,null,null,null,null,792,38,20,"FC Basel","-","Sporting Lissabon",3,":",0]
[null,null,null,null,null,null,793,40,14,"Hertha BSC","-","Benfica Lissabon",2,":",9]
[null,null,null,null,null,null,794,22,30,"Celtic Glasgow","-","FC Bologna",1,":",3]
[null,null,null,null,null,null,795,7,26,"Borussia Dortmund","-","Roter Stern Belgrad",3,":",1]
[null,null,null,null,null,null,796,27,6,"Young Boys Bern","-","Inter Mailand",0,":",2]
[null,null,null,null,null,null,797,28,10,"AS Monaco","-","Bayer Leverkusen",null,":"]
[null,null,null,null,null,null,798,21,11,"PSV Eindhoven","-","Atletico Madrid",null,":"]
[null,null,null,null,null,null,799,5,39,"FC Liverpool","-","FC Lille",null,":"]
[null,null,null,null,null,null,800,2,13,"Manchester City","-","Juventus Turin",null,":"]
[null,null,null,null,null,null,801,3,29,"FC Bayern München","-","Aston Villa",null,":"]
[null,null,null,null,null,null,802,31,25,"FC Girona","-","OSC Lille",null,":"]
[null,null,null,null,null,null,803,24,4,"Red Bull Salzburg","-","Paris Saint-Germain",null,":"]
[null,null,null,null,null,null,804,8,18,"RB Leipzig","-","AC Mailand",null,":"]
[null,null,null,null,null,null,805,17,33,"Schachtjor Donezk","-","Sturm Graz",null,":"]
[null,null,null,null,null,null,806,35,16,"Eintracht Frankfurt","-","FC Brügge",null,":"]
[null,null,null,null,null,null,807,23,32,"Dinamo Zagreb","-","VfB Stuttgart",null,":"]
[null,null,null,null,null,null,808,36,15,"Mainz 05","-","FC Arsenal",null,":"]
[null,null,null,null,null,null,809,12,19,"Atalanta Bergamo","-","Feyenoord Rotterdam",null,":"]
[null,null,null,null,null,null,810,34,1,"Stade Brest","-","Real Madrid",null,":"]
[null,null,null,null,null,null,811,20,9,"Sporting Lissabon","-","FC Barcelona",null,":"]
[null,null,null,null,null,null,812,37,40,"AC Roma","-","Hertha BSC",null,":"]
[null,null,null,null,null,null,813,30,38,"FC Bologna","-","FC Basel",null,":"]
[null,null,null,null,null,null,814,14,7,"Benfica Lissabon","-","Borussia Dortmund",null,":"]
[null,null,null,null,null,null,815,6,22,"Inter Mailand","-","Celtic Glasgow",null,":"]
[null,null,null,null,null,null,816,26,28,"Roter Stern Belgrad","-","AS Monaco",null,":"]
[null,null,null,null,null,null,817,11,27,"Atletico Madrid","-","Young Boys Bern",null,":"]
[null,null,null,null,null,null,818,10,5,"Bayer Leverkusen","-","FC Liverpool",null,":"]
[null,null,null,null,null,null,819,13,21,"Juventus Turin","-","PSV Eindhoven",null,":"]
[null,null,null,null,null,null,820,39,2,"FC Lille","-","Manchester City",null,":"]
[null,null,null,null,null,null,821,25,3,"OSC Lille","-","FC Bayern München",null,":"]
[null,null,null,null,null,null,822,29,24,"Aston Villa","-","Red Bull Salzburg",null,":"]
[null,null,null,null,null,null,823,18,31,"AC Mailand","-","FC Girona",null,":"]
[null,null,null,null,null,null,824,4,17,"Paris Saint-Germain","-","Schachtjor Donezk",null,":"]
[null,null,null,null,null,null,825,16,8,"FC Brügge","-","RB Leipzig",null,":"]
[null,null,null,null,null,null,826,33,23,"Sturm Graz","-","Dinamo Zagreb",null,":"]
[null,null,null,null,null,null,827,15,35,"FC Arsenal","-","Eintracht Frankfurt",null,":"]
[null,null,null,null,null,null,828,32,12,"VfB Stuttgart","-","Atalanta Bergamo",null,":"]
[null,null,null,null,null,null,829,1,36,"Real Madrid","-","Mainz 05",null,":"]
[null,null,null,null,null,null,830,19,20,"Feyenoord Rotterdam","-","Sporting Lissabon",null,":"]
[null,null,null,null,null,null,831,40,34,"Hertha BSC","-","Stade Brest",null,":"]
[null,null,null,null,null,null,832,9,30,"FC Barcelona","-","FC Bologna",null,":"]
[null,null,null,null,null,null,833,7,37,"Borussia Dortmund","-","AC Roma",null,":"]
[null,null,null,null,null,null,834,38,6,{"$f":"IFERROR(VLOOKUP($H839,$B$6:$C$45,2,0),\"\")","v":"FC Basel"},"-",{"$f":"IFERROR(VLOOKUP($I839,$B$6:$C$45,2,0),\"\")","v":"Inter Mailand"},null,":"]
[null,null,null,null,null,null,835,28,14,"AS Monaco","-","Benfica Lissabon",null,":"]
[null,null,null,null,null,null,836,22,11,"Celtic Glasgow","-","Atletico Madrid",null,":"]
[null,null,null,null,null,null,837,5,26,"FC Liverpool","-","Roter Stern Belgrad",null,":"]
[null,null,null,null,null,null,838,27,13,"Young Boys Bern","-","Juventus Turin",null,":"]
[null,null,null,null,null,null,839,2,10,"Manchester City","-","Bayer Leverkusen",null,":"]
[null,null,null,null,null,null,840,21,39,"PSV Eindhoven","-","FC Lille",null,":"]
[null,null,null,null,null,null,841,3,24,"FC Bayern München","-","Red Bull Salzburg",null,":"]
[null,null,null,null,null,null,842,25,18,"OSC Lille","-","AC Mailand",null,":"]
[null,null,null,null,null,null,843,17,29,"Schachtjor Donezk","-","Aston Villa",null,":"]
[null,null,null,null,null,null,844,31,16,"FC Girona","-","FC Brügge",null,":"]
[null,null,null,null,null,null,845,23,4,"Dinamo Zagreb","-","Paris Saint-Germain",null,":"]
[null,null,null,null,null,null,846,8,15,"RB Leipzig","-","FC Arsenal",null,":"]
[null,null,null,null,null,null,847,12,33,"Atalanta Bergamo","-","Sturm Graz",null,":"]
[null,null,null,null,null,null,848,35,1,"Eintracht Frankfurt","-","Real Madrid",null,":"]
[null,null,null,null,null,null,849,20,32,"Sporting Lissabon","-","VfB Stuttgart",null,":"]
[null,null,null,null,null,null,850,36,40,"Mainz 05","-","Hertha BSC",null,":"]
[null,null,null,null,null,null,851,30,19,"FC Bologna","-","Feyenoord Rotterdam",null,":"]
[null,null,null,null,null,null,852,34,7,"Stade Brest","-","Borussia Dortmund",null,":"]
[null,null,null,null,null,null,853,6,9,"Inter Mailand","-","FC Barcelona",null,":"]
[null,null,null,null,null,null,854,37,28,"AC Roma","-","AS Monaco",null,":"]
[null,null,null,null,null,null,855,11,38,"Atletico Madrid","-","FC Basel",null,":"]
[null,null,null,null,null,null,856,14,5,"Benfica Lissabon","-","FC Liverpool",null,":"]
[null,null,null,null,null,null,857,13,22,"Juventus Turin","-","Celtic Glasgow",null,":"]
[null,null,null,null,null,null,858,26,2,"Roter Stern Belgrad","-","Manchester City",null,":"]
[null,null,null,null,null,null,859,39,27,"FC Lille","-","Young Boys Bern",null,":"]
[null,null,null,null,null,null,860,10,21,"Bayer Leverkusen","-","PSV Eindhoven",null,":"]
[null,null,null,null,null,null,861,18,3,"AC Mailand","-","FC Bayern München",null,":"]
[null,null,null,null,null,null,862,24,17,"Red Bull Salzburg","-","Schachtjor Donezk",null,":"]
[null,null,null,null,null,null,863,16,25,"FC Brügge","-","OSC Lille",null,":"]
[null,null,null,null,null,null,864,29,23,"Aston Villa","-","Dinamo Zagreb",null,":"]
[null,null,null,null,null,null,865,15,31,"FC Arsenal","-","FC Girona",null,":"]
[null,null,null,null,null,null,866,4,12,"Paris Saint-Germain","-","Atalanta Bergamo",null,":"]
[null,null,null,null,null,null,867,1,8,"Real Madrid","-","RB Leipzig",null,":"]
[null,null,null,null,null,null,868,33,20,"Sturm Graz","-","Sporting Lissabon",null,":"]
[null,null,null,null,null,null,869,40,35,"Hertha BSC","-","Eintracht Frankfurt",null,":"]
[null,null,null,null,null,null,870,32,30,"VfB Stuttgart","-","FC Bologna",null,":"]
[null,null,null,null,null,null,871,7,36,"Borussia Dortmund","-","Mainz 05",null,":"]
[null,null,null,null,null,null,872,19,6,"Feyenoord Rotterdam","-","Inter Mailand",null,":"]
[null,null,null,null,null,null,873,28,34,"AS Monaco","-","Stade Brest",null,":"]
[null,null,null,null,null,null,874,9,11,"FC Barcelona","-","Atletico Madrid",null,":"]
[null,null,null,null,null,null,875,5,37,"FC Liverpool","-","AC Roma",null,":"]
[null,null,null,null,null,null,876,38,13,"FC Basel","-","Juventus Turin",null,":"]
[null,null,null,null,null,null,877,2,14,"Manchester City","-","Benfica Lissabon",null,":"]
[null,null,null,null,null,null,878,22,39,"Celtic Glasgow","-","FC Lille",null,":"]
[null,null,null,null,null,null,879,21,26,"PSV Eindhoven","-","Roter Stern Belgrad",null,":"]
[null,null,null,null,null,null,880,27,10,"Young Boys Bern","-","Bayer Leverkusen",null,":"]
[null,null,null,null,null,null,881,3,17,"FC Bayern München","-","Schachtjor Donezk",null,":"]
[null,null,null,null,null,null,882,18,16,"AC Mailand","-","FC Brügge",null,":"]
[null,null,null,null,null,null,883,23,24,"Dinamo Zagreb","-","Red Bull Salzburg",null,":"]
[null,null,null,null,null,null,884,25,15,"OSC Lille","-","FC Arsenal",null,":"]
[null,null,null,null,null,null,885,12,29,"Atalanta Bergamo","-","Aston Villa",null,":"]
[null,null,null,null,null,null,886,31,1,"FC Girona","-","Real Madrid",null,":"]
[null,null,null,null,null,null,887,20,4,"Sporting Lissabon","-","Paris Saint-Germain",null,":"]
[null,null,null,null,null,null,888,8,40,"RB Leipzig","-","Hertha BSC",null,":"]
[null,null,null,null,null,null,889,30,33,"FC Bologna","-","Sturm Graz",null,":"]
[null,null,null,null,null,null,890,35,7,"Eintracht Frankfurt","-","Borussia Dortmund",null,":"]
[null,null,null,null,null,null,891,6,32,"Inter Mailand","-","VfB Stuttgart",null,":"]
[null,null,null,null,null,null,892,36,28,"Mainz 05","-","AS Monaco",null,":"]
[null,null,null,null,null,null,893,11,19,"Atletico Madrid","-","Feyenoord Rotterdam",null,":"]
[null,null,null,null,null,null,894,34,5,"Stade Brest","-","FC Liverpool",null,":"]
[null,null,null,null,null,null,895,13,9,"Juventus Turin","-","FC Barcelona",null,":"]
[null,null,null,null,null,null,896,37,2,"AC Roma","-","Manchester City",null,":"]
[null,null,null,null,null,null,897,39,38,"FC Lille","-","FC Basel",null,":"]
[null,null,null,null,null,null,898,14,21,{"$f":"IFERROR(VLOOKUP($H903,$B$6:$C$45,2,0),\"\")","v":"Benfica Lissabon"},"-",{"$f":"IFERROR(VLOOKUP($I903,$B$6:$C$45,2,0),\"\")","v":"PSV Eindhoven"},null,":"]
[null,null,null,null,null,null,899,10,22,"Bayer Leverkusen","-","Celtic Glasgow",null,":"]
[null,null,null,null,null,null,900,26,27,"Roter Stern Belgrad","-","Young Boys Bern",null,":"]
[null,null,null,null,null,null,901,16,3,"FC Brügge","-","FC Bayern München",null,":"]
[null,null,null,null,null,null,902,17,23,"Schachtjor Donezk","-","Dinamo Zagreb",null,":"]
[null,null,null,null,null,null,903,15,18,"FC Arsenal","-","AC Mailand",null,":"]
[null,null,null,null,null,null,904,24,12,"Red Bull Salzburg","-","Atalanta Bergamo",null,":"]
[null,null,null,null,null,null,905,1,25,"Real Madrid","-","OSC Lille",null,":"]
[null,null,null,null,null,null,906,29,20,"Aston Villa","-","Sporting Lissabon",null,":"]
[null,null,null,null,null,null,907,40,31,"Hertha BSC","-","FC Girona",null,":"]
[null,null,null,null,null,null,908,4,30,"Paris Saint-Germain","-","FC Bologna",null,":"]
[null,null,null,null,null,null,909,7,8,"Borussia Dortmund","-","RB Leipzig",null,":"]
[null,null,null,null,null,null,910,33,6,"Sturm Graz","-","Inter Mailand",null,":"]
[null,null,null,null,null,null,911,28,35,"AS Monaco","-","Eintracht Frankfurt",null,":"]
[null,null,null,null,null,null,912,32,11,"VfB Stuttgart","-","Atletico Madrid",null,":"]
[null,null,null,null,null,null,913,5,36,"FC Liverpool","-","Mainz 05",null,":"]
[null,null,null,null,null,null,914,19,13,"Feyenoord Rotterdam","-","Juventus Turin",null,":"]
[null,null,null,null,null,null,915,2,34,"Manchester City","-","Stade Brest",null,":"]
[null,null,null,null,null,null,916,9,39,"FC Barcelona","-","FC Lille",null,":"]
[null,null,null,null,null,null,917,21,37,"PSV Eindhoven","-","AC Roma",null,":"]
[null,null,null,null,null,null,918,38,10,"FC Basel","-","Bayer Leverkusen",null,":"]
[null,null,null,null,null,null,919,27,14,"Young Boys Bern","-","Benfica Lissabon",null,":"]
[null,null,null,null,null,null,920,22,26,"Celtic Glasgow","-","Roter Stern Belgrad",null,":"]
[null,null,null,null,null,null,921,3,23,"FC Bayern München","-","Dinamo Zagreb",null,":"]
[null,null,null,null,null,null,922,16,15,"FC Brügge","-","FC Arsenal",null,":"]
[null,null,null,null,null,null,923,12,17,"Atalanta Bergamo","-","Schachtjor Donezk",null,":"]
[null,null,null,null,null,null,924,18,1,"AC Mailand","-","Real Madrid",null,":"]
[null,null,null,null,null,null,925,20,24,"Sporting Lissabon","-","Red Bull Salzburg",null,":"]
[null,null,null,null,null,null,926,25,40,"OSC Lille","-","Hertha BSC",null,":"]
[null,null,null,null,null,null,927,30,29,"FC Bologna","-","Aston Villa",null,":"]
[null,null,null,null,null,null,928,31,7,"FC Girona","-","Borussia Dortmund",null,":"]
[null,null,null,null,null,null,929,6,4,"Inter Mailand","-","Paris Saint-Germain",null,":"]
[null,null,null,null,null,null,930,8,28,"RB Leipzig","-","AS Monaco",null,":"]
[null,null,null,null,null,null,931,11,33,"Atletico Madrid","-","Sturm Graz",null,":"]
[null,null,null,null,null,null,932,35,5,"Eintracht Frankfurt","-","FC Liverpool",null,":"]
[null,null,null,null,null,null,933,13,32,"Juventus Turin","-","VfB Stuttgart",null,":"]
[null,null,null,null,null,null,934,36,2,"Mainz 05","-","Manchester City",null,":"]
[null,null,null,null,null,null,935,39,19,"FC Lille","-","Feyenoord Rotterdam",null,":"]
[null,null,null,null,null,null,936,34,21,"Stade Brest","-","PSV Eindhoven",null,":"]
[null,null,null,null,null,null,937,10,9,"Bayer Leverkusen","-","FC Barcelona",null,":"]
[null,null,null,null,null,null,938,37,27,"AC Roma","-","Young Boys Bern",null,":"]
[null,null,null,null,null,null,939,26,38,"Roter Stern Belgrad","-","FC Basel",null,":"]
[null,null,null,null,null,null,940,14,22,"Benfica Lissabon","-","Celtic Glasgow",null,":"]
[null,null,null,null,null,null,941,15,3,"FC Arsenal","-","FC Bayern München",null,":"]
[null,null,null,null,null,null,942,23,12,"Dinamo Zagreb","-","Atalanta Bergamo",null,":"]
[null,null,null,null,null,null,943,1,16,"Real Madrid","-","FC Brügge",null,":"]
[null,null,null,null,null,null,944,17,20,"Schachtjor Donezk","-","Sporting Lissabon",null,":"]
[null,null,null,null,null,null,945,40,18,"Hertha BSC","-","AC Mailand",null,":"]
[null,null,null,null,null,null,946,24,30,"Red Bull Salzburg","-","FC Bologna",null,":"]
[null,null,null,null,null,null,947,7,25,"Borussia Dortmund","-","OSC Lille",null,":"]
[null,null,null,null,null,null,948,29,6,"Aston Villa","-","Inter Mailand",null,":"]
[null,null,null,null,null,null,949,28,31,"AS Monaco","-","FC Girona",null,":"]
[null,null,null,null,null,null,950,4,11,"Paris Saint-Germain","-","Atletico Madrid",null,":"]
[null,null,null,null,null,null,951,5,8,"FC Liverpool","-","RB Leipzig",null,":"]
[null,null,null,null,null,null,952,33,13,"Sturm Graz","-","Juventus Turin",null,":"]
[null,null,null,null,null,null,953,2,35,"Manchester City","-","Eintracht Frankfurt",null,":"]
[null,null,null,null,null,null,954,32,39,"VfB Stuttgart","-","FC Lille",null,":"]
[null,null,null,null,null,null,955,21,36,"PSV Eindhoven","-","Mainz 05",null,":"]
[null,null,null,null,null,null,956,19,10,"Feyenoord Rotterdam","-","Bayer Leverkusen",null,":"]
[null,null,null,null,null,null,957,27,34,"Young Boys Bern","-","Stade Brest",null,":"]
[null,null,null,null,null,null,958,9,26,"FC Barcelona","-","Roter Stern Belgrad",null,":"]
[null,null,null,null,null,null,959,22,37,"Celtic Glasgow","-","AC Roma",null,":"]
[null,null,null,null,null,null,960,38,14,"FC Basel","-","Benfica Lissabon",null,":"]
[null,null,null,null,null,null,961,3,12,"FC Bayern München","-","Atalanta Bergamo",null,":"]
[null,null,null,null,null,null,962,15,1,{"$f":"IFERROR(VLOOKUP($H967,$B$6:$C$45,2,0),\"\")","v":"FC Arsenal"},"-",{"$f":"IFERROR(VLOOKUP($I967,$B$6:$C$45,2,0),\"\")","v":"Real Madrid"},null,":"]
[null,null,null,null,null,null,963,20,23,"Sporting Lissabon","-","Dinamo Zagreb",null,":"]
[null,null,null,null,null,null,964,16,40,"FC Brügge","-","Hertha BSC",null,":"]
[null,null,null,null,null,null,965,30,17,"FC Bologna","-","Schachtjor Donezk",null,":"]
[null,null,null,null,null,null,966,18,7,"AC Mailand","-","Borussia Dortmund",null,":"]
[null,null,null,null,null,null,967,6,24,"Inter Mailand","-","Red Bull Salzburg",null,":"]
[null,null,null,null,null,null,968,25,28,"OSC Lille","-","AS Monaco",null,":"]
[null,null,null,null,null,null,969,11,29,"Atletico Madrid","-","Aston Villa",null,":"]
[null,null,null,null,null,null,970,31,5,"FC Girona","-","FC Liverpool",null,":"]
[null,null,null,null,null,null,971,13,4,"Juventus Turin","-","Paris Saint-Germain",null,":"]
[null,null,null,null,null,null,972,8,2,"RB Leipzig","-","Manchester City",null,":"]
[null,null,null,null,null,null,973,39,33,"FC Lille","-","Sturm Graz",null,":"]
[null,null,null,null,null,null,974,35,21,"Eintracht Frankfurt","-","PSV Eindhoven",null,":"]
[null,null,null,null,null,null,975,10,32,"Bayer Leverkusen","-","VfB Stuttgart",null,":"]
[null,null,null,null,null,null,976,36,27,"Mainz 05","-","Young Boys Bern",null,":"]
[null,null,null,null,null,null,977,26,19,"Roter Stern Belgrad","-","Feyenoord Rotterdam",null,":"]
[null,null,null,null,null,null,978,34,22,"Stade Brest","-","Celtic Glasgow",null,":"]
[null,null,null,null,null,null,979,14,9,"Benfica Lissabon","-","FC Barcelona",null,":"]
[null,null,null,null,null,null,980,37,38,"AC Roma","-","FC Basel",null,":"]
[null,null,null,null,null,null,981,1,3,"Real Madrid","-","FC Bayern München",null,":"]
[null,null,null,null,null,null,982,12,20,"Atalanta Bergamo","-","Sporting Lissabon",null,":"]
[null,null,null,null,null,null,983,40,15,"Hertha BSC","-","FC Arsenal",null,":"]
[null,null,null,null,null,null,984,23,30,"Dinamo Zagreb","-","FC Bologna",null,":"]
[null,null,null,null,null,null,985,7,16,"Borussia Dortmund","-","FC Brügge",null,":"]
[null,null,null,null,null,null,986,17,6,"Schachtjor Donezk","-","Inter Mailand",null,":"]
[null,null,null,null,null,null,987,28,18,"AS Monaco","-","AC Mailand",null,":"]
[null,null,null,null,null,null,988,24,11,"Red Bull Salzburg","-","Atletico Madrid",null,":"]
[null,null,null,null,null,null,989,5,25,"FC Liverpool","-","OSC Lille",null,":"]
[null,null,null,null,null,null,990,29,13,"Aston Villa","-","Juventus Turin",null,":"]
[null,null,null,null,null,null,991,2,31,"Manchester City","-","FC Girona",null,":"]
[null,null,null,null,null,null,992,4,39,"Paris Saint-Germain","-","FC Lille",null,":"]
[null,null,null,null,null,null,993,21,8,"PSV Eindhoven","-","RB Leipzig",null,":"]
[null,null,null,null,null,null,994,33,10,"Sturm Graz","-","Bayer Leverkusen",null,":"]
[null,null,null,null,null,null,995,27,35,"Young Boys Bern","-","Eintracht Frankfurt",null,":"]
[null,null,null,null,null,null,996,32,26,"VfB Stuttgart","-","Roter Stern Belgrad",null,":"]
[null,null,null,null,null,null,997,22,36,"Celtic Glasgow","-","Mainz 05",null,":"]
[null,null,null,null,null,null,998,19,14,"Feyenoord Rotterdam","-","Benfica Lissabon",null,":"]
[null,null,null,null,null,null,999,38,34,"FC Basel","-","Stade Brest",null,":"]
[null,null,null,null,null,null,1000,9,37,"FC Barcelona","-","AC Roma",null,":"]
[null,null,null,null,null,null,1001,3,20,"FC Bayern München","-","Sporting Lissabon",null,":"]
[null,null,null,null,null,null,1002,1,40,"Real Madrid","-","Hertha BSC",null,":"]
[null,null,null,null,null,null,1003,30,12,"FC Bologna","-","Atalanta Bergamo",null,":"]
[null,null,null,null,null,null,1004,15,7,"FC Arsenal","-","Borussia Dortmund",null,":"]
[null,null,null,null,null,null,1005,6,23,"Inter Mailand","-","Dinamo Zagreb",null,":"]
[null,null,null,null,null,null,1006,16,28,"FC Brügge","-","AS Monaco",null,":"]
[null,null,null,null,null,null,1007,11,17,"Atletico Madrid","-","Schachtjor Donezk",null,":"]
[null,null,null,null,null,null,1008,18,5,"AC Mailand","-","FC Liverpool",null,":"]
[null,null,null,null,null,null,1009,13,24,"Juventus Turin","-","Red Bull Salzburg",null,":"]
[null,null,null,null,null,null,1010,25,2,"OSC Lille","-","Manchester City",null,":"]
[null,null,null,null,null,null,1011,39,29,"FC Lille","-","Aston Villa",null,":"]
[null,null,null,null,null,null,1012,31,21,"FC Girona","-","PSV Eindhoven",null,":"]
[null,null,null,null,null,null,1013,10,4,"Bayer Leverkusen","-","Paris Saint-Germain",null,":"]
[null,null,null,null,null,null,1014,8,27,"RB Leipzig","-","Young Boys Bern",null,":"]
[null,null,null,null,null,null,1015,26,33,"Roter Stern Belgrad","-","Sturm Graz",null,":"]
[null,null,null,null,null,null,1016,35,22,"Eintracht Frankfurt","-","Celtic Glasgow",null,":"]
[null,null,null,null,null,null,1017,14,32,"Benfica Lissabon","-","VfB Stuttgart",null,":"]
[null,null,null,null,null,null,1018,36,38,"Mainz 05","-","FC Basel",null,":"]
[null,null,null,null,null,null,1019,37,19,"AC Roma","-","Feyenoord Rotterdam",null,":"]
[null,null,null,null,null,null,1020,34,9,"Stade Brest","-","FC Barcelona",null,":"]
[null,null,null,null,null,null,1021,40,3,"Hertha BSC","-","FC Bayern München",null,":"]
[null,null,null,null,null,null,1022,20,30,"Sporting Lissabon","-","FC Bologna",null,":"]
[null,null,null,null,null,null,1023,7,1,"Borussia Dortmund","-","Real Madrid",null,":"]
[null,null,null,null,null,null,1024,12,6,"Atalanta Bergamo","-","Inter Mailand",null,":"]
[null,null,null,null,null,null,1025,28,15,"AS Monaco","-","FC Arsenal",null,":"]
[null,null,null,null,null,null,1026,23,11,{"$f":"IFERROR(VLOOKUP($H1031,$B$6:$C$45,2,0),\"\")","v":"Dinamo Zagreb"},"-",{"$f":"IFERROR(VLOOKUP($I1031,$B$6:$C$45,2,0),\"\")","v":"Atletico Madrid"},null,":"]
[null,null,null,null,null,null,1027,5,16,"FC Liverpool","-","FC Brügge",null,":"]
[null,null,null,null,null,null,1028,17,13,"Schachtjor Donezk","-","Juventus Turin",null,":"]
[null,null,null,null,null,null,1029,2,18,"Manchester City","-","AC Mailand",null,":"]
[null,null,null,null,null,null,1030,24,39,"Red Bull Salzburg","-","FC Lille",null,":"]
[null,null,null,null,null,null,1031,21,25,"PSV Eindhoven","-","OSC Lille",null,":"]
[null,null,null,null,null,null,1032,29,10,"Aston Villa","-","Bayer Leverkusen",null,":"]
[null,null,null,null,null,null,1033,27,31,"Young Boys Bern","-","FC Girona",null,":"]
[null,null,null,null,null,null,1034,4,26,"Paris Saint-Germain","-","Roter Stern Belgrad",null,":"]
[null,null,null,null,null,null,1035,22,8,"Celtic Glasgow","-","RB Leipzig",null,":"]
[null,null,null,null,null,null,1036,33,14,"Sturm Graz","-","Benfica Lissabon",null,":"]
[null,null,null,null,null,null,1037,38,35,"FC Basel","-","Eintracht Frankfurt",null,":"]
[null,null,null,null,null,null,1038,32,37,"VfB Stuttgart","-","AC Roma",null,":"]
[null,null,null,null,null,null,1039,9,36,"FC Barcelona","-","Mainz 05",null,":"]
[null,null,null,null,null,null,1040,19,34,"Feyenoord Rotterdam","-","Stade Brest",null,":"]
[null,null,null,null,null,null,1041,3,30,"FC Bayern München","-","FC Bologna",null,":"]
[null,null,null,null,null,null,1042,40,7,"Hertha BSC","-","Borussia Dortmund",null,":"]
[null,null,null,null,null,null,1043,6,20,"Inter Mailand","-","Sporting Lissabon",null,":"]
[null,null,null,null,null,null,1044,1,28,"Real Madrid","-","AS Monaco",null,":"]
[null,null,null,null,null,null,1045,11,12,"Atletico Madrid","-","Atalanta Bergamo",null,":"]
[null,null,null,null,null,null,1046,15,5,"FC Arsenal","-","FC Liverpool",null,":"]
[null,null,null,null,null,null,1047,13,23,"Juventus Turin","-","Dinamo Zagreb",null,":"]
[null,null,null,null,null,null,1048,16,2,"FC Brügge","-","Manchester City",null,":"]
[null,null,null,null,null,null,1049,39,17,"FC Lille","-","Schachtjor Donezk",null,":"]
[null,null,null,null,null,null,1050,18,21,"AC Mailand","-","PSV Eindhoven",null,":"]
[null,null,null,null,null,null,1051,10,24,"Bayer Leverkusen","-","Red Bull Salzburg",null,":"]
[null,null,null,null,null,null,1052,25,27,"OSC Lille","-","Young Boys Bern",null,":"]
[null,null,null,null,null,null,1053,26,29,"Roter Stern Belgrad","-","Aston Villa",null,":"]
[null,null,null,null,null,null,1054,31,22,"FC Girona","-","Celtic Glasgow",null,":"]
[null,null,null,null,null,null,1055,14,4,"Benfica Lissabon","-","Paris Saint-Germain",null,":"]
[null,null,null,null,null,null,1056,8,38,"RB Leipzig","-","FC Basel",null,":"]
[null,null,null,null,null,null,1057,37,33,"AC Roma","-","Sturm Graz",null,":"]
[null,null,null,null,null,null,1058,35,9,"Eintracht Frankfurt","-","FC Barcelona",null,":"]
[null,null,null,null,null,null,1059,34,32,"Stade Brest","-","VfB Stuttgart",null,":"]
[null,null,null,null,null,null,1060,36,19,"Mainz 05","-","Feyenoord Rotterdam",null,":"]
[null,null,null,null,null,null,1061,7,3,"Borussia Dortmund","-","FC Bayern München",null,":"]
[null,null,null,null,null,null,1062,30,6,"FC Bologna","-","Inter Mailand",null,":"]
[null,null,null,null,null,null,1063,28,40,"AS Monaco","-","Hertha BSC",null,":"]
[null,null,null,null,null,null,1064,20,11,"Sporting Lissabon","-","Atletico Madrid",null,":"]
[null,null,null,null,null,null,1065,5,1,"FC Liverpool","-","Real Madrid",null,":"]
[null,null,null,null,null,null,1066,12,13,"Atalanta Bergamo","-","Juventus Turin",null,":"]
[null,null,null,null,null,null,1067,2,15,"Manchester City","-","FC Arsenal",null,":"]
[null,null,null,null,null,null,1068,23,39,"Dinamo Zagreb","-","FC Lille",null,":"]
[null,null,null,null,null,null,1069,21,16,"PSV Eindhoven","-","FC Brügge",null,":"]
[null,null,null,null,null,null,1070,17,10,"Schachtjor Donezk","-","Bayer Leverkusen",null,":"]
[null,null,null,null,null,null,1071,27,18,"Young Boys Bern","-","AC Mailand",null,":"]
[null,null,null,null,null,null,1072,24,26,"Red Bull Salzburg","-","Roter Stern Belgrad",null,":"]
[null,null,null,null,null,null,1073,22,25,"Celtic Glasgow","-","OSC Lille",null,":"]
[null,null,null,null,null,null,1074,29,14,"Aston Villa","-","Benfica Lissabon",null,":"]
[null,null,null,null,null,null,1075,38,31,"FC Basel","-","FC Girona",null,":"]
[null,null,null,null,null,null,1076,4,37,"Paris Saint-Germain","-","AC Roma",null,":"]
[null,null,null,null,null,null,1077,9,8,"FC Barcelona","-","RB Leipzig",null,":"]
[null,null,null,null,null,null,1078,33,34,"Sturm Graz","-","Stade Brest",null,":"]
[null,null,null,null,null,null,1079,19,35,"Feyenoord Rotterdam","-","Eintracht Frankfurt",null,":"]
[null,null,null,null,null,null,1080,32,36,"VfB Stuttgart","-","Mainz 05",null,":"]
[null,null,null,null,null,null,1081,3,6,"FC Bayern München","-","Inter Mailand",null,":"]
[null,null,null,null,null,null,1082,7,28,"Borussia Dortmund","-","AS Monaco",null,":"]
[null,null,null,null,null,null,1083,11,30,"Atletico Madrid","-","FC Bologna",null,":"]
[null,null,null,null,null,null,1084,40,5,"Hertha BSC","-","FC Liverpool",null,":"]
[null,null,null,null,null,null,1085,13,20,"Juventus Turin","-","Sporting Lissabon",null,":"]
[null,null,null,null,null,null,1086,1,2,"Real Madrid","-","Manchester City",null,":"]
[null,null,null,null,null,null,1087,39,12,"FC Lille","-","Atalanta Bergamo",null,":"]
[null,null,null,null,null,null,1088,15,21,"FC Arsenal","-","PSV Eindhoven",null,":"]
[null,null,null,null,null,null,1089,10,23,"Bayer Leverkusen","-","Dinamo Zagreb",null,":"]
[null,null,null,null,null,null,1090,16,27,{"$f":"IFERROR(VLOOKUP($H1095,$B$6:$C$45,2,0),\"\")","v":"FC Brügge"},"-",{"$f":"IFERROR(VLOOKUP($I1095,$B$6:$C$45,2,0),\"\")","v":"Young Boys Bern"},null,":"]
[null,null,null,null,null,null,1091,26,17,"Roter Stern Belgrad","-","Schachtjor Donezk",null,":"]
[null,null,null,null,null,null,1092,18,22,"AC Mailand","-","Celtic Glasgow",null,":"]
[null,null,null,null,null,null,1093,14,24,"Benfica Lissabon","-","Red Bull Salzburg",null,":"]
[null,null,null,null,null,null,1094,25,38,"OSC Lille","-","FC Basel",null,":"]
[null,null,null,null,null,null,1095,37,29,"AC Roma","-","Aston Villa",null,":"]
[null,null,null,null,null,null,1096,31,9,"FC Girona","-","FC Barcelona",null,":"]
[null,null,null,null,null,null,1097,34,4,"Stade Brest","-","Paris Saint-Germain",null,":"]
[null,null,null,null,null,null,1098,8,19,"RB Leipzig","-","Feyenoord Rotterdam",null,":"]
[null,null,null,null,null,null,1099,36,33,"Mainz 05","-","Sturm Graz",null,":"]
[null,null,null,null,null,null,1100,35,32,"Eintracht Frankfurt","-","VfB Stuttgart",null,":"]
[null,null,null,null,null,null,1101,28,3,"AS Monaco","-","FC Bayern München",null,":"]
[null,null,null,null,null,null,1102,6,11,"Inter Mailand","-","Atletico Madrid",null,":"]
[null,null,null,null,null,null,1103,5,7,"FC Liverpool","-","Borussia Dortmund",null,":"]
[null,null,null,null,null,null,1104,30,13,"FC Bologna","-","Juventus Turin",null,":"]
[null,null,null,null,null,null,1105,2,40,"Manchester City","-","Hertha BSC",null,":"]
[null,null,null,null,null,null,1106,20,39,"Sporting Lissabon","-","FC Lille",null,":"]
[null,null,null,null,null,null,1107,21,1,"PSV Eindhoven","-","Real Madrid",null,":"]
[null,null,null,null,null,null,1108,12,10,"Atalanta Bergamo","-","Bayer Leverkusen",null,":"]
[null,null,null,null,null,null,1109,27,15,"Young Boys Bern","-","FC Arsenal",null,":"]
[null,null,null,null,null,null,1110,23,26,"Dinamo Zagreb","-","Roter Stern Belgrad",null,":"]
[null,null,null,null,null,null,1111,22,16,"Celtic Glasgow","-","FC Brügge",null,":"]
[null,null,null,null,null,null,1112,17,14,"Schachtjor Donezk","-","Benfica Lissabon",null,":"]
[null,null,null,null,null,null,1113,38,18,"FC Basel","-","AC Mailand",null,":"]
[null,null,null,null,null,null,1114,24,37,"Red Bull Salzburg","-","AC Roma",null,":"]
[null,null,null,null,null,null,1115,9,25,"FC Barcelona","-","OSC Lille",null,":"]
[null,null,null,null,null,null,1116,29,34,"Aston Villa","-","Stade Brest",null,":"]
[null,null,null,null,null,null,1117,19,31,"Feyenoord Rotterdam","-","FC Girona",null,":"]
[null,null,null,null,null,null,1118,4,36,"Paris Saint-Germain","-","Mainz 05",null,":"]
[null,null,null,null,null,null,1119,32,8,"VfB Stuttgart","-","RB Leipzig",null,":"]
[null,null,null,null,null,null,1120,33,35,"Sturm Graz","-","Eintracht Frankfurt",null,":"]
[null,null,null,null,null,null,1121,3,11,"FC Bayern München","-","Atletico Madrid",null,":"]
[null,null,null,null,null,null,1122,28,5,"AS Monaco","-","FC Liverpool",null,":"]
[null,null,null,null,null,null,1123,13,6,"Juventus Turin","-","Inter Mailand",null,":"]
[null,null,null,null,null,null,1124,7,2,"Borussia Dortmund","-","Manchester City",null,":"]
[null,null,null,null,null,null,1125,39,30,"FC Lille","-","FC Bologna",null,":"]
[null,null,null,null,null,null,1126,40,21,"Hertha BSC","-","PSV Eindhoven",null,":"]
[null,null,null,null,null,null,1127,10,20,"Bayer Leverkusen","-","Sporting Lissabon",null,":"]
[null,null,null,null,null,null,1128,1,27,"Real Madrid","-","Young Boys Bern",null,":"]
[null,null,null,null,null,null,1129,26,12,"Roter Stern Belgrad","-","Atalanta Bergamo",null,":"]
[null,null,null,null,null,null,1130,15,22,"FC Arsenal","-","Celtic Glasgow",null,":"]
[null,null,null,null,null,null,1131,14,23,"Benfica Lissabon","-","Dinamo Zagreb",null,":"]
[null,null,null,null,null,null,1132,16,38,"FC Brügge","-","FC Basel",null,":"]
[null,null,null,null,null,null,1133,37,17,"AC Roma","-","Schachtjor Donezk",null,":"]
[null,null,null,null,null,null,1134,18,9,"AC Mailand","-","FC Barcelona",null,":"]
[null,null,null,null,null,null,1135,34,24,"Stade Brest","-","Red Bull Salzburg",null,":"]
[null,null,null,null,null,null,1136,25,19,"OSC Lille","-","Feyenoord Rotterdam",null,":"]
[null,null,null,null,null,null,1137,36,29,"Mainz 05","-","Aston Villa",null,":"]
[null,null,null,null,null,null,1138,31,32,"FC Girona","-","VfB Stuttgart",null,":"]
[null,null,null,null,null,null,1139,35,4,"Eintracht Frankfurt","-","Paris Saint-Germain",null,":"]
[null,null,null,null,null,null,1140,8,33,"RB Leipzig","-","Sturm Graz",null,":"]
[null,null,null,null,null,null,1141,5,3,"FC Liverpool","-","FC Bayern München",null,":"]
[null,null,null,null,null,null,1142,11,13,"Atletico Madrid","-","Juventus Turin",null,":"]
[null,null,null,null,null,null,1143,2,28,"Manchester City","-","AS Monaco",null,":"]
[null,null,null,null,null,null,1144,6,39,"Inter Mailand","-","FC Lille",null,":"]
[null,null,null,null,null,null,1145,21,7,"PSV Eindhoven","-","Borussia Dortmund",null,":"]
[null,null,null,null,null,null,1146,30,10,"FC Bologna","-","Bayer Leverkusen",null,":"]
[null,null,null,null,null,null,1147,27,40,"Young Boys Bern","-","Hertha BSC",null,":"]
[null,null,null,null,null,null,1148,20,26,"Sporting Lissabon","-","Roter Stern Belgrad",null,":"]
[null,null,null,null,null,null,1149,22,1,"Celtic Glasgow","-","Real Madrid",null,":"]
[null,null,null,null,null,null,1150,12,14,"Atalanta Bergamo","-","Benfica Lissabon",null,":"]
[null,null,null,null,null,null,1151,38,15,"FC Basel","-","FC Arsenal",null,":"]
[null,null,null,null,null,null,1152,23,37,"Dinamo Zagreb","-","AC Roma",null,":"]
[null,null,null,null,null,null,1153,9,16,"FC Barcelona","-","FC Brügge",null,":"]
[null,null,null,null,null,null,1154,17,34,{"$f":"IFERROR(VLOOKUP($H1159,$B$6:$C$45,2,0),\"\")","v":"Schachtjor Donezk"},"-",{"$f":"IFERROR(VLOOKUP($I1159,$B$6:$C$45,2,0),\"\")","v":"Stade Brest"},null,":"]
[null,null,null,null,null,null,1155,19,18,"Feyenoord Rotterdam","-","AC Mailand",null,":"]
[null,null,null,null,null,null,1156,24,36,"Red Bull Salzburg","-","Mainz 05",null,":"]
[null,null,null,null,null,null,1157,32,25,"VfB Stuttgart","-","OSC Lille",null,":"]
[null,null,null,null,null,null,1158,29,35,"Aston Villa","-","Eintracht Frankfurt",null,":"]
[null,null,null,null,null,null,1159,33,31,"Sturm Graz","-","FC Girona",null,":"]
[null,null,null,null,null,null,1160,4,8,"Paris Saint-Germain","-","RB Leipzig",null,":"]
[null,null,null,null,null,null,1161,3,13,"FC Bayern München","-","Juventus Turin",null,":"]
[null,null,null,null,null,null,1162,5,2,"FC Liverpool","-","Manchester City",null,":"]
[null,null,null,null,null,null,1163,39,11,"FC Lille","-","Atletico Madrid",null,":"]
[null,null,null,null,null,null,1164,28,21,"AS Monaco","-","PSV Eindhoven",null,":"]
[null,null,null,null,null,null,1165,10,6,"Bayer Leverkusen","-","Inter Mailand",null,":"]
[null,null,null,null,null,null,1166,7,27,"Borussia Dortmund","-","Young Boys Bern",null,":"]
[null,null,null,null,null,null,1167,26,30,"Roter Stern Belgrad","-","FC Bologna",null,":"]
[null,null,null,null,null,null,1168,40,22,"Hertha BSC","-","Celtic Glasgow",null,":"]
[null,null,null,null,null,null,1169,14,20,"Benfica Lissabon","-","Sporting Lissabon",null,":"]
[null,null,null,null,null,null,1170,1,38,"Real Madrid","-","FC Basel",null,":"]
[null,null,null,null,null,null,1171,37,12,"AC Roma","-","Atalanta Bergamo",null,":"]
[null,null,null,null,null,null,1172,15,9,"FC Arsenal","-","FC Barcelona",null,":"]
[null,null,null,null,null,null,1173,34,23,"Stade Brest","-","Dinamo Zagreb",null,":"]
[null,null,null,null,null,null,1174,16,19,"FC Brügge","-","Feyenoord Rotterdam",null,":"]
[null,null,null,null,null,null,1175,36,17,"Mainz 05","-","Schachtjor Donezk",null,":"]
[null,null,null,null,null,null,1176,18,32,"AC Mailand","-","VfB Stuttgart",null,":"]
[null,null,null,null,null,null,1177,35,24,"Eintracht Frankfurt","-","Red Bull Salzburg",null,":"]
[null,null,null,null,null,null,1178,25,33,"OSC Lille","-","Sturm Graz",null,":"]
[null,null,null,null,null,null,1179,8,29,"RB Leipzig","-","Aston Villa",null,":"]
[null,null,null,null,null,null,1180,31,4,"FC Girona","-","Paris Saint-Germain",null,":"]
[null,null,null,null,null,null,1181,2,3,"Manchester City","-","FC Bayern München",null,":"]
[null,null,null,null,null,null,1182,13,39,"Juventus Turin","-","FC Lille",null,":"]
[null,null,null,null,null,null,1183,21,5,"PSV Eindhoven","-","FC Liverpool",null,":"]
[null,null,null,null,null,null,1184,11,10,"Atletico Madrid","-","Bayer Leverkusen",null,":"]
[null,null,null,null,null,null,1185,27,28,"Young Boys Bern","-","AS Monaco",null,":"]
[null,null,null,null,null,null,1186,6,26,"Inter Mailand","-","Roter Stern Belgrad",null,":"]
[null,null,null,null,null,null,1187,22,7,"Celtic Glasgow","-","Borussia Dortmund",null,":"]
[null,null,null,null,null,null,1188,30,14,"FC Bologna","-","Benfica Lissabon",null,":"]
[null,null,null,null,null,null,1189,38,40,"FC Basel","-","Hertha BSC",null,":"]
[null,null,null,null,null,null,1190,20,37,"Sporting Lissabon","-","AC Roma",null,":"]
[null,null,null,null,null,null,1191,9,1,"FC Barcelona","-","Real Madrid",null,":"]
[null,null,null,null,null,null,1192,12,34,"Atalanta Bergamo","-","Stade Brest",null,":"]
[null,null,null,null,null,null,1193,19,15,"Feyenoord Rotterdam","-","FC Arsenal",null,":"]
[null,null,null,null,null,null,1194,23,36,"Dinamo Zagreb","-","Mainz 05",null,":"]
[null,null,null,null,null,null,1195,32,16,"VfB Stuttgart","-","FC Brügge",null,":"]
[null,null,null,null,null,null,1196,17,35,"Schachtjor Donezk","-","Eintracht Frankfurt",null,":"]
[null,null,null,null,null,null,1197,33,18,"Sturm Graz","-","AC Mailand",null,":"]
[null,null,null,null,null,null,1198,24,8,"Red Bull Salzburg","-","RB Leipzig",null,":"]
[null,null,null,null,null,null,1199,4,25,"Paris Saint-Germain","-","OSC Lille",null,":"]
[null,null,null,null,null,null,1200,29,31,"Aston Villa","-","FC Girona",null,":"]
[null,null,null,null,null,null,1201,3,39,"FC Bayern München","-","FC Lille",null,":"]
[null,null,null,null,null,null,1202,2,21,"Manchester City","-","PSV Eindhoven",null,":"]
[null,null,null,null,null,null,1203,10,13,"Bayer Leverkusen","-","Juventus Turin",null,":"]
[null,null,null,null,null,null,1204,5,27,"FC Liverpool","-","Young Boys Bern",null,":"]
[null,null,null,null,null,null,1205,26,11,"Roter Stern Belgrad","-","Atletico Madrid",null,":"]
[null,null,null,null,null,null,1206,28,22,"AS Monaco","-","Celtic Glasgow",null,":"]
[null,null,null,null,null,null,1207,14,6,"Benfica Lissabon","-","Inter Mailand",null,":"]
[null,null,null,null,null,null,1208,7,38,"Borussia Dortmund","-","FC Basel",null,":"]
[null,null,null,null,null,null,1209,37,30,"AC Roma","-","FC Bologna",null,":"]
[null,null,null,null,null,null,1210,40,9,"Hertha BSC","-","FC Barcelona",null,":"]
[null,null,null,null,null,null,1211,34,20,"Stade Brest","-","Sporting Lissabon",null,":"]
[null,null,null,null,null,null,1212,1,19,"Real Madrid","-","Feyenoord Rotterdam",null,":"]
[null,null,null,null,null,null,1213,36,12,"Mainz 05","-","Atalanta Bergamo",null,":"]
[null,null,null,null,null,null,1214,15,32,"FC Arsenal","-","VfB Stuttgart",null,":"]
[null,null,null,null,null,null,1215,35,23,"Eintracht Frankfurt","-","Dinamo Zagreb",null,":"]
[null,null,null,null,null,null,1216,16,33,"FC Brügge","-","Sturm Graz",null,":"]
[null,null,null,null,null,null,1217,8,17,"RB Leipzig","-","Schachtjor Donezk",null,":"]
[null,null,null,null,null,null,1218,18,4,{"$f":"IFERROR(VLOOKUP($H1223,$B$6:$C$45,2,0),\"\")","v":"AC Mailand"},"-",{"$f":"IFERROR(VLOOKUP($I1223,$B$6:$C$45,2,0),\"\")","v":"Paris Saint-Germain"},null,":"]
[null,null,null,null,null,null,1219,31,24,"FC Girona","-","Red Bull Salzburg",null,":"]
[null,null,null,null,null,null,1220,25,29,"OSC Lille","-","Aston Villa",null,":"]
[null,null,null,null,null,null,1221,21,3,"PSV Eindhoven","-","FC Bayern München",null,":"]
[null,null,null,null,null,null,1222,39,10,"FC Lille","-","Bayer Leverkusen",null,":"]
[null,null,null,null,null,null,1223,27,2,"Young Boys Bern","-","Manchester City",null,":"]
[null,null,null,null,null,null,1224,13,26,"Juventus Turin","-","Roter Stern Belgrad",null,":"]
[null,null,null,null,null,null,1225,22,5,"Celtic Glasgow","-","FC Liverpool",null,":"]
[null,null,null,null,null,null,1226,11,14,"Atletico Madrid","-","Benfica Lissabon",null,":"]
[null,null,null,null,null,null,1227,38,28,"FC Basel","-","AS Monaco",null,":"]
[null,null,null,null,null,null,1228,6,37,"Inter Mailand","-","AC Roma",null,":"]
[null,null,null,null,null,null,1229,9,7,"FC Barcelona","-","Borussia Dortmund",null,":"]
[null,null,null,null,null,null,1230,30,34,"FC Bologna","-","Stade Brest",null,":"]
[null,null,null,null,null,null,1231,19,40,"Feyenoord Rotterdam","-","Hertha BSC",null,":"]
[null,null,null,null,null,null,1232,20,36,"Sporting Lissabon","-","Mainz 05",null,":"]
[null,null,null,null,null,null,1233,32,1,"VfB Stuttgart","-","Real Madrid",null,":"]
[null,null,null,null,null,null,1234,12,35,"Atalanta Bergamo","-","Eintracht Frankfurt",null,":"]
[null,null,null,null,null,null,1235,33,15,"Sturm Graz","-","FC Arsenal",null,":"]
[null,null,null,null,null,null,1236,23,8,"Dinamo Zagreb","-","RB Leipzig",null,":"]
[null,null,null,null,null,null,1237,4,16,"Paris Saint-Germain","-","FC Brügge",null,":"]
[null,null,null,null,null,null,1238,17,31,"Schachtjor Donezk","-","FC Girona",null,":"]
[null,null,null,null,null,null,1239,29,18,"Aston Villa","-","AC Mailand",null,":"]
[null,null,null,null,null,null,1240,24,25,"Red Bull Salzburg","-","OSC Lille",null,":"]
[null,null,null,null,null,null,1241,3,10,"FC Bayern München","-","Bayer Leverkusen",null,":"]
[null,null,null,null,null,null,1242,21,27,"PSV Eindhoven","-","Young Boys Bern",null,":"]
[null,null,null,null,null,null,1243,26,39,"Roter Stern Belgrad","-","FC Lille",null,":"]
[null,null,null,null,null,null,1244,2,22,"Manchester City","-","Celtic Glasgow",null,":"]
[null,null,null,null,null,null,1245,14,13,"Benfica Lissabon","-","Juventus Turin",null,":"]
[null,null,null,null,null,null,1246,5,38,"FC Liverpool","-","FC Basel",null,":"]
[null,null,null,null,null,null,1247,37,11,"AC Roma","-","Atletico Madrid",null,":"]
[null,null,null,null,null,null,1248,28,9,"AS Monaco","-","FC Barcelona",null,":"]
[null,null,null,null,null,null,1249,34,6,"Stade Brest","-","Inter Mailand",null,":"]
[null,null,null,null,null,null,1250,7,19,"Borussia Dortmund","-","Feyenoord Rotterdam",null,":"]
[null,null,null,null,null,null,1251,36,30,"Mainz 05","-","FC Bologna",null,":"]
[null,null,null,null,null,null,1252,40,32,"Hertha BSC","-","VfB Stuttgart",null,":"]
[null,null,null,null,null,null,1253,35,20,"Eintracht Frankfurt","-","Sporting Lissabon",null,":"]
[null,null,null,null,null,null,1254,1,33,"Real Madrid","-","Sturm Graz",null,":"]
[null,null,null,null,null,null,1255,8,12,"RB Leipzig","-","Atalanta Bergamo",null,":"]
[null,null,null,null,null,null,1256,15,4,"FC Arsenal","-","Paris Saint-Germain",null,":"]
[null,null,null,null,null,null,1257,31,23,"FC Girona","-","Dinamo Zagreb",null,":"]
[null,null,null,null,null,null,1258,16,29,"FC Brügge","-","Aston Villa",null,":"]
[null,null,null,null,null,null,1259,25,17,"OSC Lille","-","Schachtjor Donezk",null,":"]
[null,null,null,null,null,null,1260,18,24,"AC Mailand","-","Red Bull Salzburg",null,":"]
[null,null,null,null,null,null,1261,27,3,"Young Boys Bern","-","FC Bayern München",null,":"]
[null,null,null,null,null,null,1262,10,26,"Bayer Leverkusen","-","Roter Stern Belgrad",null,":"]
[null,null,null,null,null,null,1263,22,21,"Celtic Glasgow","-","PSV Eindhoven",null,":"]
[null,null,null,null,null,null,1264,39,14,"FC Lille","-","Benfica Lissabon",null,":"]
[null,null,null,null,null,null,1265,38,2,"FC Basel","-","Manchester City",null,":"]
[null,null,null,null,null,null,1266,13,37,"Juventus Turin","-","AC Roma",null,":"]
[null,null,null,null,null,null,1267,9,5,"FC Barcelona","-","FC Liverpool",null,":"]
[null,null,null,null,null,null,1268,11,34,"Atletico Madrid","-","Stade Brest",null,":"]
[null,null,null,null,null,null,1269,19,28,"Feyenoord Rotterdam","-","AS Monaco",null,":"]
[null,null,null,null,null,null,1270,6,36,"Inter Mailand","-","Mainz 05",null,":"]
[null,null,null,null,null,null,1271,32,7,"VfB Stuttgart","-","Borussia Dortmund",null,":"]
[null,null,null,null,null,null,1272,30,35,"FC Bologna","-","Eintracht Frankfurt",null,":"]
[null,null,null,null,null,null,1273,33,40,"Sturm Graz","-","Hertha BSC",null,":"]
[null,null,null,null,null,null,1274,20,8,"Sporting Lissabon","-","RB Leipzig",null,":"]
[null,null,null,null,null,null,1275,4,1,"Paris Saint-Germain","-","Real Madrid",null,":"]
[null,null,null,null,null,null,1276,12,31,"Atalanta Bergamo","-","FC Girona",null,":"]
[null,null,null,null,null,null,1277,29,15,"Aston Villa","-","FC Arsenal",null,":"]
[null,null,null,null,null,null,1278,23,25,"Dinamo Zagreb","-","OSC Lille",null,":"]
[null,null,null,null,null,null,1279,24,16,"Red Bull Salzburg","-","FC Brügge",null,":"]
[null,null,null,null,null,null,1280,17,18,"Schachtjor Donezk","-","AC Mailand",null,":"]
[null,null,null,null,null,null,1281,3,26,"FC Bayern München","-","Roter Stern Belgrad",null,":"]
[null,null,null,null,null,null,1282,27,22,{"$f":"IFERROR(VLOOKUP($H1287,$B$6:$C$45,2,0),\"\")","v":"Young Boys Bern"},"-",{"$f":"IFERROR(VLOOKUP($I1287,$B$6:$C$45,2,0),\"\")","v":"Celtic Glasgow"},null,":"]
[null,null,null,null,null,null,1283,14,10,"Benfica Lissabon","-","Bayer Leverkusen",null,":"]
[null,null,null,null,null,null,1284,21,38,"PSV Eindhoven","-","FC Basel",null,":"]
[null,null,null,null,null,null,1285,37,39,"AC Roma","-","FC Lille",null,":"]
[null,null,null,null,null,null,1286,2,9,"Manchester City","-","FC Barcelona",null,":"]
[null,null,null,null,null,null,1287,34,13,"Stade Brest","-","Juventus Turin",null,":"]
[null,null,null,null,null,null,1288,5,19,"FC Liverpool","-","Feyenoord Rotterdam",null,":"]
[null,null,null,null,null,null,1289,36,11,"Mainz 05","-","Atletico Madrid",null,":"]
[null,null,null,null,null,null,1290,28,32,"AS Monaco","-","VfB Stuttgart",null,":"]
[null,null,null,null,null,null,1291,35,6,"Eintracht Frankfurt","-","Inter Mailand",null,":"]
[null,null,null,null,null,null,1292,7,33,"Borussia Dortmund","-","Sturm Graz",null,":"]
[null,null,null,null,null,null,1293,8,30,"RB Leipzig","-","FC Bologna",null,":"]
[null,null,null,null,null,null,1294,40,4,"Hertha BSC","-","Paris Saint-Germain",null,":"]
[null,null,null,null,null,null,1295,31,20,"FC Girona","-","Sporting Lissabon",null,":"]
[null,null,null,null,null,null,1296,1,29,"Real Madrid","-","Aston Villa",null,":"]
[null,null,null,null,null,null,1297,25,12,"OSC Lille","-","Atalanta Bergamo",null,":"]
[null,null,null,null,null,null,1298,15,24,"FC Arsenal","-","Red Bull Salzburg",null,":"]
[null,null,null,null,null,null,1299,18,23,"AC Mailand","-","Dinamo Zagreb",null,":"]
[null,null,null,null,null,null,1300,16,17,"FC Brügge","-","Schachtjor Donezk",null,":"]
[null,null,null,null,null,null,1301,22,3,"Celtic Glasgow","-","FC Bayern München",null,":"]
[null,null,null,null,null,null,1302,26,14,"Roter Stern Belgrad","-","Benfica Lissabon",null,":"]
[null,null,null,null,null,null,1303,38,27,"FC Basel","-","Young Boys Bern",null,":"]
[null,null,null,null,null,null,1304,10,37,"Bayer Leverkusen","-","AC Roma",null,":"]
[null,null,null,null,null,null,1305,9,21,"FC Barcelona","-","PSV Eindhoven",null,":"]
[null,null,null,null,null,null,1306,39,34,"FC Lille","-","Stade Brest",null,":"]
[null,null,null,null,null,null,1307,19,2,"Feyenoord Rotterdam","-","Manchester City",null,":"]
[null,null,null,null,null,null,1308,13,36,"Juventus Turin","-","Mainz 05",null,":"]
[null,null,null,null,null,null,1309,32,5,"VfB Stuttgart","-","FC Liverpool",null,":"]
[null,null,null,null,null,null,1310,11,35,"Atletico Madrid","-","Eintracht Frankfurt",null,":"]
[null,null,null,null,null,null,1311,33,28,"Sturm Graz","-","AS Monaco",null,":"]
[null,null,null,null,null,null,1312,6,8,"Inter Mailand","-","RB Leipzig",null,":"]
[null,null,null,null,null,null,1313,4,7,"Paris Saint-Germain","-","Borussia Dortmund",null,":"]
[null,null,null,null,null,null,1314,30,31,"FC Bologna","-","FC Girona",null,":"]
[null,null,null,null,null,null,1315,29,40,"Aston Villa","-","Hertha BSC",null,":"]
[null,null,null,null,null,null,1316,20,25,"Sporting Lissabon","-","OSC Lille",null,":"]
[null,null,null,null,null,null,1317,24,1,"Red Bull Salzburg","-","Real Madrid",null,":"]
[null,null,null,null,null,null,1318,12,18,"Atalanta Bergamo","-","AC Mailand",null,":"]
[null,null,null,null,null,null,1319,17,15,"Schachtjor Donezk","-","FC Arsenal",null,":"]
[null,null,null,null,null,null,1320,23,16,"Dinamo Zagreb","-","FC Brügge",null,":"]
[null,null,null,null,null,null,1321,3,14,"FC Bayern München","-","Benfica Lissabon",null,":"]
[null,null,null,null,null,null,1322,22,38,"Celtic Glasgow","-","FC Basel",null,":"]
[null,null,null,null,null,null,1323,37,26,"AC Roma","-","Roter Stern Belgrad",null,":"]
[null,null,null,null,null,null,1324,27,9,"Young Boys Bern","-","FC Barcelona",null,":"]
[null,null,null,null,null,null,1325,34,10,"Stade Brest","-","Bayer Leverkusen",null,":"]
[null,null,null,null,null,null,1326,21,19,"PSV Eindhoven","-","Feyenoord Rotterdam",null,":"]
[null,null,null,null,null,null,1327,36,39,"Mainz 05","-","FC Lille",null,":"]
[null,null,null,null,null,null,1328,2,32,"Manchester City","-","VfB Stuttgart",null,":"]
[null,null,null,null,null,null,1329,35,13,"Eintracht Frankfurt","-","Juventus Turin",null,":"]
[null,null,null,null,null,null,1330,5,33,"FC Liverpool","-","Sturm Graz",null,":"]
[null,null,null,null,null,null,1331,8,11,"RB Leipzig","-","Atletico Madrid",null,":"]
[null,null,null,null,null,null,1332,28,4,"AS Monaco","-","Paris Saint-Germain",null,":"]
[null,null,null,null,null,null,1333,31,6,"FC Girona","-","Inter Mailand",null,":"]
[null,null,null,null,null,null,1334,7,29,"Borussia Dortmund","-","Aston Villa",null,":"]
[null,null,null,null,null,null,1335,25,30,"OSC Lille","-","FC Bologna",null,":"]
[null,null,null,null,null,null,1336,40,24,"Hertha BSC","-","Red Bull Salzburg",null,":"]
[null,null,null,null,null,null,1337,18,20,"AC Mailand","-","Sporting Lissabon",null,":"]
[null,null,null,null,null,null,1338,1,17,"Real Madrid","-","Schachtjor Donezk",null,":"]
[null,null,null,null,null,null,1339,16,12,"FC Brügge","-","Atalanta Bergamo",null,":"]
[null,null,null,null,null,null,1340,15,23,"FC Arsenal","-","Dinamo Zagreb",null,":"]
[null,null,null,null,null,null,1341,38,3,"FC Basel","-","FC Bayern München",null,":"]
[null,null,null,null,null,null,1342,14,37,"Benfica Lissabon","-","AC Roma",null,":"]
[null,null,null,null,null,null,1343,9,22,"FC Barcelona","-","Celtic Glasgow",null,":"]
[null,null,null,null,null,null,1344,26,34,"Roter Stern Belgrad","-","Stade Brest",null,":"]
[null,null,null,null,null,null,1345,19,27,"Feyenoord Rotterdam","-","Young Boys Bern",null,":"]
[null,null,null,null,null,null,1346,10,36,{"$f":"IFERROR(VLOOKUP($H1351,$B$6:$C$45,2,0),\"\")","v":"Bayer Leverkusen"},"-",{"$f":"IFERROR(VLOOKUP($I1351,$B$6:$C$45,2,0),\"\")","v":"Mainz 05"},null,":"]
[null,null,null,null,null,null,1347,32,21,"VfB Stuttgart","-","PSV Eindhoven",null,":"]
[null,null,null,null,null,null,1348,39,35,"FC Lille","-","Eintracht Frankfurt",null,":"]
[null,null,null,null,null,null,1349,33,2,"Sturm Graz","-","Manchester City",null,":"]
[null,null,null,null,null,null,1350,13,8,"Juventus Turin","-","RB Leipzig",null,":"]
[null,null,null,null,null,null,1351,4,5,"Paris Saint-Germain","-","FC Liverpool",null,":"]
[null,null,null,null,null,null,1352,11,31,"Atletico Madrid","-","FC Girona",null,":"]
[null,null,null,null,null,null,1353,29,28,"Aston Villa","-","AS Monaco",null,":"]
[null,null,null,null,null,null,1354,6,25,"Inter Mailand","-","OSC Lille",null,":"]
[null,null,null,null,null,null,1355,24,7,"Red Bull Salzburg","-","Borussia Dortmund",null,":"]
[null,null,null,null,null,null,1356,30,18,"FC Bologna","-","AC Mailand",null,":"]
[null,null,null,null,null,null,1357,17,40,"Schachtjor Donezk","-","Hertha BSC",null,":"]
[null,null,null,null,null,null,1358,20,16,"Sporting Lissabon","-","FC Brügge",null,":"]
[null,null,null,null,null,null,1359,23,1,"Dinamo Zagreb","-","Real Madrid",null,":"]
[null,null,null,null,null,null,1360,12,15,"Atalanta Bergamo","-","FC Arsenal",null,":"]
[null,null,null,null,null,null,1361,3,37,"FC Bayern München","-","AC Roma",null,":"]
[null,null,null,null,null,null,1362,38,9,"FC Basel","-","FC Barcelona",null,":"]
[null,null,null,null,null,null,1363,34,14,"Stade Brest","-","Benfica Lissabon",null,":"]
[null,null,null,null,null,null,1364,22,19,"Celtic Glasgow","-","Feyenoord Rotterdam",null,":"]
[null,null,null,null,null,null,1365,36,26,"Mainz 05","-","Roter Stern Belgrad",null,":"]
[null,null,null,null,null,null,1366,27,32,"Young Boys Bern","-","VfB Stuttgart",null,":"]
[null,null,null,null,null,null,1367,35,10,"Eintracht Frankfurt","-","Bayer Leverkusen",null,":"]
[null,null,null,null,null,null,1368,21,33,"PSV Eindhoven","-","Sturm Graz",null,":"]
[null,null,null,null,null,null,1369,8,39,"RB Leipzig","-","FC Lille",null,":"]
[null,null,null,null,null,null,1370,2,4,"Manchester City","-","Paris Saint-Germain",null,":"]
[null,null,null,null,null,null,1371,31,13,"FC Girona","-","Juventus Turin",null,":"]
[null,null,null,null,null,null,1372,5,29,"FC Liverpool","-","Aston Villa",null,":"]
[null,null,null,null,null,null,1373,25,11,"OSC Lille","-","Atletico Madrid",null,":"]
[null,null,null,null,null,null,1374,28,24,"AS Monaco","-","Red Bull Salzburg",null,":"]
[null,null,null,null,null,null,1375,18,6,"AC Mailand","-","Inter Mailand",null,":"]
[null,null,null,null,null,null,1376,7,17,"Borussia Dortmund","-","Schachtjor Donezk",null,":"]
[null,null,null,null,null,null,1377,16,30,"FC Brügge","-","FC Bologna",null,":"]
[null,null,null,null,null,null,1378,40,23,"Hertha BSC","-","Dinamo Zagreb",null,":"]
[null,null,null,null,null,null,1379,15,20,"FC Arsenal","-","Sporting Lissabon",null,":"]
[null,null,null,null,null,null,1380,1,12,"Real Madrid","-","Atalanta Bergamo",null,":"]
[null,null,null,null,null,null,1381,9,3,"FC Barcelona","-","FC Bayern München",null,":"]
[null,null,null,null,null,null,1382,37,34,"AC Roma","-","Stade Brest",null,":"]
[null,null,null,null,null,null,1383,19,38,"Feyenoord Rotterdam","-","FC Basel",null,":"]
[null,null,null,null,null,null,1384,14,36,"Benfica Lissabon","-","Mainz 05",null,":"]
[null,null,null,null,null,null,1385,32,22,"VfB Stuttgart","-","Celtic Glasgow",null,":"]
[null,null,null,null,null,null,1386,26,35,"Roter Stern Belgrad","-","Eintracht Frankfurt",null,":"]
[null,null,null,null,null,null,1387,33,27,"Sturm Graz","-","Young Boys Bern",null,":"]
[null,null,null,null,null,null,1388,10,8,"Bayer Leverkusen","-","RB Leipzig",null,":"]
[null,null,null,null,null,null,1389,4,21,"Paris Saint-Germain","-","PSV Eindhoven",null,":"]
[null,null,null,null,null,null,1390,39,31,"FC Lille","-","FC Girona",null,":"]
[null,null,null,null,null,null,1391,29,2,"Aston Villa","-","Manchester City",null,":"]
[null,null,null,null,null,null,1392,13,25,"Juventus Turin","-","OSC Lille",null,":"]
[null,null,null,null,null,null,1393,24,5,"Red Bull Salzburg","-","FC Liverpool",null,":"]
[null,null,null,null,null,null,1394,11,18,"Atletico Madrid","-","AC Mailand",null,":"]
[null,null,null,null,null,null,1395,17,28,"Schachtjor Donezk","-","AS Monaco",null,":"]
[null,null,null,null,null,null,1396,6,16,"Inter Mailand","-","FC Brügge",null,":"]
[null,null,null,null,null,null,1397,23,7,"Dinamo Zagreb","-","Borussia Dortmund",null,":"]
[null,null,null,null,null,null,1398,30,15,"FC Bologna","-","FC Arsenal",null,":"]
[null,null,null,null,null,null,1399,12,40,"Atalanta Bergamo","-","Hertha BSC",null,":"]
[null,null,null,null,null,null,1400,20,1,"Sporting Lissabon","-","Real Madrid",null,":"]
[null,null,null,null,null,null,1401,3,34,"FC Bayern München","-","Stade Brest",null,":"]
[null,null,null,null,null,null,1402,9,19,"FC Barcelona","-","Feyenoord Rotterdam",null,":"]
[null,null,null,null,null,null,1403,36,37,"Mainz 05","-","AC Roma",null,":"]
[null,null,null,null,null,null,1404,38,32,"FC Basel","-","VfB Stuttgart",null,":"]
[null,null,null,null,null,null,1405,35,14,"Eintracht Frankfurt","-","Benfica Lissabon",null,":"]
[null,null,null,null,null,null,1406,22,33,"Celtic Glasgow","-","Sturm Graz",null,":"]
[null,null,null,null,null,null,1407,8,26,"RB Leipzig","-","Roter Stern Belgrad",null,":"]
[null,null,null,null,null,null,1408,27,4,"Young Boys Bern","-","Paris Saint-Germain",null,":"]
[null,null,null,null,null,null,1409,31,10,"FC Girona","-","Bayer Leverkusen",null,":"]
[null,null,null,null,null,null,1410,21,29,{"$f":"IFERROR(VLOOKUP($H1415,$B$6:$C$45,2,0),\"\")","v":"PSV Eindhoven"},"-",{"$f":"IFERROR(VLOOKUP($I1415,$B$6:$C$45,2,0),\"\")","v":"Aston Villa"},null,":"]
[null,null,null,null,null,null,1411,25,39,"OSC Lille","-","FC Lille",null,":"]
[null,null,null,null,null,null,1412,2,24,"Manchester City","-","Red Bull Salzburg",null,":"]
[null,null,null,null,null,null,1413,18,13,"AC Mailand","-","Juventus Turin",null,":"]
[null,null,null,null,null,null,1414,5,17,"FC Liverpool","-","Schachtjor Donezk",null,":"]
[null,null,null,null,null,null,1415,16,11,"FC Brügge","-","Atletico Madrid",null,":"]
[null,null,null,null,null,null,1416,28,23,"AS Monaco","-","Dinamo Zagreb",null,":"]
[null,null,null,null,null,null,1417,15,6,"FC Arsenal","-","Inter Mailand",null,":"]
[null,null,null,null,null,null,1418,7,12,"Borussia Dortmund","-","Atalanta Bergamo",null,":"]
[null,null,null,null,null,null,1419,1,30,"Real Madrid","-","FC Bologna",null,":"]
[null,null,null,null,null,null,1420,40,20,"Hertha BSC","-","Sporting Lissabon",null,":"]
[null,null,null,null,null,null,1421,19,3,"Feyenoord Rotterdam","-","FC Bayern München",null,":"]
[null,null,null,null,null,null,1422,34,36,"Stade Brest","-","Mainz 05",null,":"]
[null,null,null,null,null,null,1423,32,9,"VfB Stuttgart","-","FC Barcelona",null,":"]
[null,null,null,null,null,null,1424,37,35,"AC Roma","-","Eintracht Frankfurt",null,":"]
[null,null,null,null,null,null,1425,33,38,"Sturm Graz","-","FC Basel",null,":"]
[null,null,null,null,null,null,1426,14,8,"Benfica Lissabon","-","RB Leipzig",null,":"]
[null,null,null,null,null,null,1427,4,22,"Paris Saint-Germain","-","Celtic Glasgow",null,":"]
[null,null,null,null,null,null,1428,26,31,"Roter Stern Belgrad","-","FC Girona",null,":"]
[null,null,null,null,null,null,1429,29,27,"Aston Villa","-","Young Boys Bern",null,":"]
[null,null,null,null,null,null,1430,10,25,"Bayer Leverkusen","-","OSC Lille",null,":"]
[null,null,null,null,null,null,1431,24,21,"Red Bull Salzburg","-","PSV Eindhoven",null,":"]
[null,null,null,null,null,null,1432,39,18,"FC Lille","-","AC Mailand",null,":"]
[null,null,null,null,null,null,1433,17,2,"Schachtjor Donezk","-","Manchester City",null,":"]
[null,null,null,null,null,null,1434,13,16,"Juventus Turin","-","FC Brügge",null,":"]
[null,null,null,null,null,null,1435,23,5,"Dinamo Zagreb","-","FC Liverpool",null,":"]
[null,null,null,null,null,null,1436,11,15,"Atletico Madrid","-","FC Arsenal",null,":"]
[null,null,null,null,null,null,1437,12,28,"Atalanta Bergamo","-","AS Monaco",null,":"]
[null,null,null,null,null,null,1438,6,1,"Inter Mailand","-","Real Madrid",null,":"]
[null,null,null,null,null,null,1439,20,7,"Sporting Lissabon","-","Borussia Dortmund",null,":"]
[null,null,null,null,null,null,1440,30,40,"FC Bologna","-","Hertha BSC",null,":"]
[null,null,null,null,null,null,1441,3,36,"FC Bayern München","-","Mainz 05",null,":"]
[null,null,null,null,null,null,1442,19,32,"Feyenoord Rotterdam","-","VfB Stuttgart",null,":"]
[null,null,null,null,null,null,1443,35,34,"Eintracht Frankfurt","-","Stade Brest",null,":"]
[null,null,null,null,null,null,1444,9,33,"FC Barcelona","-","Sturm Graz",null,":"]
[null,null,null,null,null,null,1445,8,37,"RB Leipzig","-","AC Roma",null,":"]
[null,null,null,null,null,null,1446,38,4,"FC Basel","-","Paris Saint-Germain",null,":"]
[null,null,null,null,null,null,1447,31,14,"FC Girona","-","Benfica Lissabon",null,":"]
[null,null,null,null,null,null,1448,22,29,"Celtic Glasgow","-","Aston Villa",null,":"]
[null,null,null,null,null,null,1449,25,26,"OSC Lille","-","Roter Stern Belgrad",null,":"]
[null,null,null,null,null,null,1450,27,24,"Young Boys Bern","-","Red Bull Salzburg",null,":"]
[null,null,null,null,null,null,1451,18,10,"AC Mailand","-","Bayer Leverkusen",null,":"]
[null,null,null,null,null,null,1452,21,17,"PSV Eindhoven","-","Schachtjor Donezk",null,":"]
[null,null,null,null,null,null,1453,16,39,"FC Brügge","-","FC Lille",null,":"]
[null,null,null,null,null,null,1454,2,23,"Manchester City","-","Dinamo Zagreb",null,":"]
[null,null,null,null,null,null,1455,15,13,"FC Arsenal","-","Juventus Turin",null,":"]
[null,null,null,null,null,null,1456,5,12,"FC Liverpool","-","Atalanta Bergamo",null,":"]
[null,null,null,null,null,null,1457,1,11,"Real Madrid","-","Atletico Madrid",null,":"]
[null,null,null,null,null,null,1458,28,20,"AS Monaco","-","Sporting Lissabon",null,":"]
[null,null,null,null,null,null,1459,40,6,"Hertha BSC","-","Inter Mailand",null,":"]
[null,null,null,null,null,null,1460,7,30,"Borussia Dortmund","-","FC Bologna",null,":"]
[null,null,null,null,null,null,1461,32,3,"VfB Stuttgart","-","FC Bayern München",null,":"]
[null,null,null,null,null,null,1462,36,35,"Mainz 05","-","Eintracht Frankfurt",null,":"]
[null,null,null,null,null,null,1463,33,19,"Sturm Graz","-","Feyenoord Rotterdam",null,":"]
[null,null,null,null,null,null,1464,34,8,"Stade Brest","-","RB Leipzig",null,":"]
[null,null,null,null,null,null,1465,4,9,"Paris Saint-Germain","-","FC Barcelona",null,":"]
[null,null,null,null,null,null,1466,37,31,"AC Roma","-","FC Girona",null,":"]
[null,null,null,null,null,null,1467,29,38,"Aston Villa","-","FC Basel",null,":"]
[null,null,null,null,null,null,1468,14,25,"Benfica Lissabon","-","OSC Lille",null,":"]
[null,null,null,null,null,null,1469,24,22,"Red Bull Salzburg","-","Celtic Glasgow",null,":"]
[null,null,null,null,null,null,1470,26,18,"Roter Stern Belgrad","-","AC Mailand",null,":"]
[null,null,null,null,null,null,1471,17,27,"Schachtjor Donezk","-","Young Boys Bern",null,":"]
[null,null,null,null,null,null,1472,10,16,"Bayer Leverkusen","-","FC Brügge",null,":"]
[null,null,null,null,null,null,1473,23,21,"Dinamo Zagreb","-","PSV Eindhoven",null,":"]
[null,null,null,null,null,null,1474,39,15,{"$f":"IFERROR(VLOOKUP($H1479,$B$6:$C$45,2,0),\"\")","v":"FC Lille"},"-",{"$f":"IFERROR(VLOOKUP($I1479,$B$6:$C$45,2,0),\"\")","v":"FC Arsenal"},null,":"]
[null,null,null,null,null,null,1475,12,2,"Atalanta Bergamo","-","Manchester City",null,":"]
[null,null,null,null,null,null,1476,13,1,"Juventus Turin","-","Real Madrid",null,":"]
[null,null,null,null,null,null,1477,20,5,"Sporting Lissabon","-","FC Liverpool",null,":"]
[null,null,null,null,null,null,1478,11,40,"Atletico Madrid","-","Hertha BSC",null,":"]
[null,null,null,null,null,null,1479,30,28,"FC Bologna","-","AS Monaco",null,":"]
[null,null,null,null,null,null,1480,6,7,"Inter Mailand","-","Borussia Dortmund",null,":"]
[null,null,null,null,null,null,1481,3,35,"FC Bayern München","-","Eintracht Frankfurt",null,":"]
[null,null,null,null,null,null,1482,32,33,"VfB Stuttgart","-","Sturm Graz",null,":"]
[null,null,null,null,null,null,1483,8,36,"RB Leipzig","-","Mainz 05",null,":"]
[null,null,null,null,null,null,1484,19,4,"Feyenoord Rotterdam","-","Paris Saint-Germain",null,":"]
[null,null,null,null,null,null,1485,31,34,"FC Girona","-","Stade Brest",null,":"]
[null,null,null,null,null,null,1486,9,29,"FC Barcelona","-","Aston Villa",null,":"]
[null,null,null,null,null,null,1487,25,37,"OSC Lille","-","AC Roma",null,":"]
[null,null,null,null,null,null,1488,38,24,"FC Basel","-","Red Bull Salzburg",null,":"]
[null,null,null,null,null,null,1489,18,14,"AC Mailand","-","Benfica Lissabon",null,":"]
[null,null,null,null,null,null,1490,22,17,"Celtic Glasgow","-","Schachtjor Donezk",null,":"]
[null,null,null,null,null,null,1491,16,26,"FC Brügge","-","Roter Stern Belgrad",null,":"]
[null,null,null,null,null,null,1492,27,23,"Young Boys Bern","-","Dinamo Zagreb",null,":"]
[null,null,null,null,null,null,1493,15,10,"FC Arsenal","-","Bayer Leverkusen",null,":"]
[null,null,null,null,null,null,1494,21,12,"PSV Eindhoven","-","Atalanta Bergamo",null,":"]
[null,null,null,null,null,null,1495,1,39,"Real Madrid","-","FC Lille",null,":"]
[null,null,null,null,null,null,1496,2,20,"Manchester City","-","Sporting Lissabon",null,":"]
[null,null,null,null,null,null,1497,40,13,"Hertha BSC","-","Juventus Turin",null,":"]
[null,null,null,null,null,null,1498,5,30,"FC Liverpool","-","FC Bologna",null,":"]
[null,null,null,null,null,null,1499,7,11,"Borussia Dortmund","-","Atletico Madrid",null,":"]
[null,null,null,null,null,null,1500,28,6,"AS Monaco","-","Inter Mailand",null,":"]
[null,null,null,null,null,null,1501,33,3,"Sturm Graz","-","FC Bayern München",null,":"]
[null,null,null,null,null,null,1502,35,8,"Eintracht Frankfurt","-","RB Leipzig",null,":"]
[null,null,null,null,null,null,1503,4,32,"Paris Saint-Germain","-","VfB Stuttgart",null,":"]
[null,null,null,null,null,null,1504,36,31,"Mainz 05","-","FC Girona",null,":"]
[null,null,null,null,null,null,1505,29,19,"Aston Villa","-","Feyenoord Rotterdam",null,":"]
[null,null,null,null,null,null,1506,34,25,"Stade Brest","-","OSC Lille",null,":"]
[null,null,null,null,null,null,1507,24,9,"Red Bull Salzburg","-","FC Barcelona",null,":"]
[null,null,null,null,null,null,1508,37,18,"AC Roma","-","AC Mailand",null,":"]
[null,null,null,null,null,null,1509,17,38,"Schachtjor Donezk","-","FC Basel",null,":"]
[null,null,null,null,null,null,1510,14,16,"Benfica Lissabon","-","FC Brügge",null,":"]
[null,null,null,null,null,null,1511,23,22,"Dinamo Zagreb","-","Celtic Glasgow",null,":"]
[null,null,null,null,null,null,1512,26,15,"Roter Stern Belgrad","-","FC Arsenal",null,":"]
[null,null,null,null,null,null,1513,12,27,"Atalanta Bergamo","-","Young Boys Bern",null,":"]
[null,null,null,null,null,null,1514,10,1,"Bayer Leverkusen","-","Real Madrid",null,":"]
[null,null,null,null,null,null,1515,20,21,"Sporting Lissabon","-","PSV Eindhoven",null,":"]
[null,null,null,null,null,null,1516,39,40,"FC Lille","-","Hertha BSC",null,":"]
[null,null,null,null,null,null,1517,30,2,"FC Bologna","-","Manchester City",null,":"]
[null,null,null,null,null,null,1518,13,7,"Juventus Turin","-","Borussia Dortmund",null,":"]
[null,null,null,null,null,null,1519,6,5,"Inter Mailand","-","FC Liverpool",null,":"]
[null,null,null,null,null,null,1520,11,28,"Atletico Madrid","-","AS Monaco",null,":"]
[null,null,null,null,null,null,1521,3,8,"FC Bayern München","-","RB Leipzig",null,":"]
[null,null,null,null,null,null,1522,33,4,"Sturm Graz","-","Paris Saint-Germain",null,":"]
[null,null,null,null,null,null,1523,31,35,"FC Girona","-","Eintracht Frankfurt",null,":"]
[null,null,null,null,null,null,1524,32,29,"VfB Stuttgart","-","Aston Villa",null,":"]
[null,null,null,null,null,null,1525,25,36,"OSC Lille","-","Mainz 05",null,":"]
[null,null,null,null,null,null,1526,19,24,"Feyenoord Rotterdam","-","Red Bull Salzburg",null,":"]
[null,null,null,null,null,null,1527,18,34,"AC Mailand","-","Stade Brest",null,":"]
[null,null,null,null,null,null,1528,9,17,"FC Barcelona","-","Schachtjor Donezk",null,":"]
[null,null,null,null,null,null,1529,16,37,"FC Brügge","-","AC Roma",null,":"]
[null,null,null,null,null,null,1530,38,23,"FC Basel","-","Dinamo Zagreb",null,":"]
[null,null,null,null,null,null,1531,15,14,"FC Arsenal","-","Benfica Lissabon",null,":"]
[null,null,null,null,null,null,1532,22,12,"Celtic Glasgow","-","Atalanta Bergamo",null,":"]
[null,null,null,null,null,null,1533,1,26,"Real Madrid","-","Roter Stern Belgrad",null,":"]
[null,null,null,null,null,null,1534,27,20,"Young Boys Bern","-","Sporting Lissabon",null,":"]
[null,null,null,null,null,null,1535,40,10,"Hertha BSC","-","Bayer Leverkusen",null,":"]
[null,null,null,null,null,null,1536,21,30,"PSV Eindhoven","-","FC Bologna",null,":"]
[null,null,null,null,null,null,1537,7,39,"Borussia Dortmund","-","FC Lille",null,":"]
[null,null,null,null,null,null,1538,2,6,{"$f":"IFERROR(VLOOKUP($H1543,$B$6:$C$45,2,0),\"\")","v":"Manchester City"},"-",{"$f":"IFERROR(VLOOKUP($I1543,$B$6:$C$45,2,0),\"\")","v":"Inter Mailand"},null,":"]
[null,null,null,null,null,null,1539,28,13,"AS Monaco","-","Juventus Turin",null,":"]
[null,null,null,null,null,null,1540,5,11,"FC Liverpool","-","Atletico Madrid",null,":"]
[null,null,null,null,null,null,1541,4,3,"Paris Saint-Germain","-","FC Bayern München",null,":"]
[null,null,null,null,null,null,1542,8,31,"RB Leipzig","-","FC Girona",null,":"]
[null,null,null,null,null,null,1543,29,33,"Aston Villa","-","Sturm Graz",null,":"]
[null,null,null,null,null,null,1544,35,25,"Eintracht Frankfurt","-","OSC Lille",null,":"]
[null,null,null,null,null,null,1545,24,32,"Red Bull Salzburg","-","VfB Stuttgart",null,":"]
[null,null,null,null,null,null,1546,36,18,"Mainz 05","-","AC Mailand",null,":"]
[null,null,null,null,null,null,1547,17,19,"Schachtjor Donezk","-","Feyenoord Rotterdam",null,":"]
[null,null,null,null,null,null,1548,34,16,"Stade Brest","-","FC Brügge",null,":"]
[null,null,null,null,null,null,1549,23,9,"Dinamo Zagreb","-","FC Barcelona",null,":"]
[null,null,null,null,null,null,1550,37,15,"AC Roma","-","FC Arsenal",null,":"]
[null,null,null,null,null,null,1551,12,38,"Atalanta Bergamo","-","FC Basel",null,":"]
[null,null,null,null,null,null,1552,14,1,"Benfica Lissabon","-","Real Madrid",null,":"]
[null,null,null,null,null,null,1553,20,22,"Sporting Lissabon","-","Celtic Glasgow",null,":"]
[null,null,null,null,null,null,1554,26,40,"Roter Stern Belgrad","-","Hertha BSC",null,":"]
[null,null,null,null,null,null,1555,30,27,"FC Bologna","-","Young Boys Bern",null,":"]
[null,null,null,null,null,null,1556,10,7,"Bayer Leverkusen","-","Borussia Dortmund",null,":"]
[null,null,null,null,null,null,1557,6,21,"Inter Mailand","-","PSV Eindhoven",null,":"]
[null,null,null,null,null,null,1558,39,28,"FC Lille","-","AS Monaco",null,":"]
[null,null,null,null,null,null,1559,11,2,"Atletico Madrid","-","Manchester City",null,":"]
[null,null,null,null,null,null,1560,13,5,"Juventus Turin","-","FC Liverpool",null,":"]

{"sheet":"1 x 200","index":2,"n_rows":2005,"n_cols":234,"rows_kept":2005,"cut":false,"hidden":false,"merged":[[0,0,0,1],[1,0,1,1],[1,6,1,14],[3,1,3,2],[3,16,3,17],[2,9,2,11],[3,34,3,37],[4,7,4,8],[4,12,4,14],[4,22,4,24],[4,30,4,32],[3,29,3,33]]}
[]
[null,null,null,null,null,null,"Spielplan 1 x 200"]
[null,null,null,null,null,null,null,null,null,"(ohne Rückspiele)"]
[null,"Gruppe A",null,null,null,null,null,null,null,null,null,null,null,null,null,null,"Tabelle Gruppe A",null,null,null,null,null,null,null,null,null,null,null,null,"Direktvergleiche",null,null,null,null,"Hinspiele"]
[null,"Nr","Team","Tie Break","Strafpkt.",null,"Nr","Paarung",null,null,null,null,"Ergebnis",null,null,null,"Rang","Team","Sp","G","U","V","Tore",null,null,"Diff","Pkt",null,null,"Pkt","Tore",null,null,"Diff",{"$f":"LEFT($R$6,6)","v":"TM 173"},{"$f":"LEFT($R$7,6)","v":"TM 120"},{"$f":"LEFT($R$8,6)","v":"Aston "},{"$f":"LEFT($R$9,6)","v":"TM 89"},{"$f":"LEFT($R$10,6)","v":"TM 199"},{"$f":"LEFT($R$11,6)","v":"TM 56"},{"$f":"LEFT($R$12,6)","v":"TM 94"},{"$f":"LEFT($R$13,6)","v":"TM 83"},{"$f":"LEFT($R$14,6)","v":"TM 142"},{"$f":"LEFT($R$15,6)","v":"TM 134"},{"$f":"LEFT($R$16,6)","v":"TM 166"},{"$f":"LEFT($R$17,6)","v":"TM 144"},{"$f":"LEFT($R$18,6)","v":"TM 76"},{"$f":"LEFT($R$19,6)","v":"TM 87"},{"$f":"LEFT($R$20,6)","v":"TM 122"},{"$f":"LEFT($R$21,6)","v":"TM 91"},{"$f":"LEFT($R$22,6)","v":"TM 71"},{"$f":"LEFT($R$23,6)","v":"TM 185"},{"$f":"LEFT($R$24,6)","v":"TM 132"},{"$f":"LEFT($R$25,6)","v":"TM 88"},{"$f":"LEFT($R$26,6)","v":"TM 42"},{"$f":"LEFT($R$27,6)","v":"TM 157"},{"$f":"LEFT($R$28,6)","v":"TM 85"},{"$f":"LEFT($R$29,6)","v":"TM 174"},{"$f":"LEFT($R$30,6)","v":"TM 96"},{"$f":"LEFT($R$31,6)","v":"Inter "},{"$f":"LEFT($R$32,6)","v":"TM 128"},{"$f":"LEFT($R$33,6)","v":"Juvent"},{"$f":"LEFT($R$34,6)","v":"TM 58"},{"$f":"LEFT($R$35,6)","v":"Benfic"},{"$f":"LEFT($R$36,6)","v":"Hertha"},{"$f":"LEFT($R$37,6)","v":"Atalan"},{"$f":"LEFT($R$38,6)","v":"TM 108"},{"$f":"LEFT($R$39,6)","v":"TM 75"},{"$f":"LEFT($R$40,6)","v":"TM 70"},{"$f":"LEFT($R$41,6)","v":"TM 159"},{"$f":"LEFT($R$42,6)","v":"TM 86"},{"$f":"LEFT($R$43,6)","v":"TM 186"},{"$f":"LEFT($R$44,6)","v":"Feyeno"},{"$f":"LEFT($R$45,6)","v":"TM 59"},{"$f":"LEFT($R$46,6)","v":"TM 164"},{"$f":"LEFT($R$47,6)","v":"TM 138"},{"$f":"LEFT($R$48,6)","v":"OSC Li"},{"$f":"LEFT($R$49,6)","v":"TM 177"},{"$f":"LEFT($R$50,6)","v":"AC Rom"},{"$f":"LEFT($R$51,6)","v":"TM 47"},{"$f":"LEFT($R$52,6)","v":"TM 139"},{"$f":"LEFT($R$53,6)","v":"TM 184"},{"$f":"LEFT($R$54,6)","v":"TM 48"},{"$f":"LEFT($R$55,6)","v":"RB Lei"},{"$f":"LEFT($R$56,6)","v":"TM 62"},{"$f":"LEFT($R$57,6)","v":"AS Mon"},{"$f":"LEFT($R$58,6)","v":"TM 50"},{"$f":"LEFT($R$59,6)","v":"TM 168"},{"$f":"LEFT($R$60,6)","v":"FC Gir"},{"$f":"LEFT($R$61,6)","v":"TM 191"},{"$f":"LEFT($R$62,6)","v":"TM 178"},{"$f":"LEFT($R$63,6)","v":"TM 147"},{"$f":"LEFT($R$64,6)","v":"TM 73"},{"$f":"LEFT($R$65,6)","v":"TM 181"},{"$f":"LEFT($R$66,6)","v":"TM 175"},{"$f":"LEFT($R$67,6)","v":"TM 46"},{"$f":"LEFT($R$68,6)","v":"Eintra"},{"$f":"LEFT($R$69,6)","v":"TM 160"},{"$f":"LEFT($R$70,6)","v":"TM 197"},{"$f":"LEFT($R$71,6)","v":"TM 109"},{"$f":"LEFT($R$72,6)","v":"TM 118"},{"$f":"LEFT($R$73,6)","v":"TM 140"},{"$f":"LEFT($R$74,6)","v":"TM 183"},{"$f":"LEFT($R$75,6)","v":"TM 117"},{"$f":"LEFT($R$76,6)","v":"Red Bu"},{"$f":"LEFT($R$77,6)","v":"TM 196"},{"$f":"LEFT($R$78,6)","v":"TM 170"},{"$f":"LEFT($R$79,6)","v":"TM 151"},{"$f":"LEFT($R$80,6)","v":"TM 99"},{"$f":"LEFT($R$81,6)","v":"TM 198"},{"$f":"LEFT($R$82,6)","v":"TM 66"},{"$f":"LEFT($R$83,6)","v":"TM 80"},{"$f":"LEFT($R$84,6)","v":"TM 149"},{"$f":"LEFT($R$85,6)","v":"TM 131"},{"$f":"LEFT($R$86,6)","v":"TM 162"},{"$f":"LEFT($R$87,6)","v":"TM 143"},{"$f":"LEFT($R$88,6)","v":"Boruss"},{"$f":"LEFT($R$89,6)","v":"FC Bas"},{"$f":"LEFT($R$90,6)","v":"Dinamo"},{"$f":"LEFT($R$91,6)","v":"TM 90"},{"$f":"LEFT($R$92,6)","v":"TM 64"},{"$f":"LEFT($R$93,6)","v":"TM 152"},{"$f":"LEFT($R$94,6)","v":"TM 84"},{"$f":"LEFT($R$95,6)","v":"TM 163"},{"$f":"LEFT($R$96,6)","v":"TM 124"},{"$f":"LEFT($R$97,6)","v":"TM 193"},{"$f":"LEFT($R$98,6)","v":"TM 123"},{"$f":"LEFT($R$99,6)","v":"TM 155"},{"$f":"LEFT($R$100,6)","v":"TM 129"},{"$f":"LEFT($R$101,6)","v":"TM 127"},{"$f":"LEFT($R$102,6)","v":"TM 103"},{"$f":"LEFT($R$103,6)","v":"TM 52"},{"$f":"LEFT($R$104,6)","v":"TM 82"},{"$f":"LEFT($R$105,6)","v":"TM 189"},{"$f":"LEFT($R$106,6)","v":"TM 188"},{"$f":"LEFT($R$107,6)","v":"TM 105"},{"$f":"LEFT($R$108,6)","v":"TM 115"},{"$f":"LEFT($R$109,6)","v":"TM 97"},{"$f":"LEFT($R$110,6)","v":"TM 135"},{"$f":"LEFT($R$111,6)","v":"TM 176"},{"$f":"LEFT($R$112,6)","v":"TM 54"},{"$f":"LEFT($R$113,6)","v":"TM 190"},{"$f":"LEFT($R$114,6)","v":"TM 194"},{"$f":"LEFT($R$115,6)","v":"TM 154"},{"$f":"LEFT($R$116,6)","v":"Mainz "},{"$f":"LEFT($R$117,6)","v":"TM 187"},{"$f":"LEFT($R$118,6)","v":"Paris "},{"$f":"LEFT($R$119,6)","v":"TM 182"},{"$f":"LEFT($R$120,6)","v":"FC Liv"},{"$f":"LEFT($R$121,6)","v":"FC Brü"},{"$f":"LEFT($R$122,6)","v":"TM 161"},{"$f":"LEFT($R$123,6)","v":"TM 192"},{"$f":"LEFT($R$124,6)","v":"TM 130"},{"$f":"LEFT($R$125,6)","v":"FC Bol"},{"$f":"LEFT($R$126,6)","v":"TM 145"},{"$f":"LEFT($R$127,6)","v":"TM 195"},{"$f":"LEFT($R$128,6)","v":"TM 45"},{"$f":"LEFT($R$129,6)","v":"TM 95"},{"$f":"LEFT($R$130,6)","v":"Sporti"},{"$f":"LEFT($R$131,6)","v":"TM 146"},{"$f":"LEFT($R$132,6)","v":"TM 53"},{"$f":"LEFT($R$133,6)","v":"TM 65"},{"$f":"LEFT($R$134,6)","v":"AC Mai"},{"$f":"LEFT($R$135,6)","v":"TM 200"},{"$f":"LEFT($R$136,6)","v":"TM 169"},{"$f":"LEFT($R$137,6)","v":"TM 156"},{"$f":"LEFT($R$138,6)","v":"Bayer "},{"$f":"LEFT($R$139,6)","v":"TM 67"},{"$f":"LEFT($R$140,6)","v":"TM 110"},{"$f":"LEFT($R$141,6)","v":"Sturm "},{"$f":"LEFT($R$142,6)","v":"VfB St"},{"$f":"LEFT($R$143,6)","v":"TM 114"},{"$f":"LEFT($R$144,6)","v":"TM 133"},{"$f":"LEFT($R$145,6)","v":"Schach"},{"$f":"LEFT($R$146,6)","v":"PSV Ei"},{"$f":"LEFT($R$147,6)","v":"TM 79"},{"$f":"LEFT($R$148,6)","v":"TM 179"},{"$f":"LEFT($R$149,6)","v":"TM 153"},{"$f":"LEFT($R$150,6)","v":"TM 43"},{"$f":"LEFT($R$151,6)","v":"TM 107"},{"$f":"LEFT($R$152,6)","v":"TM 104"},{"$f":"LEFT($R$153,6)","v":"TM 100"},{"$f":"LEFT($R$154,6)","v":"TM 55"},{"$f":"LEFT($R$155,6)","v":"TM 81"},{"$f":"LEFT($R$156,6)","v":"TM 126"},{"$f":"LEFT($R$157,6)","v":"TM 102"},{"$f":"LEFT($R$158,6)","v":"TM 61"},{"$f":"LEFT($R$159,6)","v":"TM 51"},{"$f":"LEFT($R$160,6)","v":"TM 77"},{"$f":"LEFT($R$161,6)","v":"TM 93"},{"$f":"LEFT($R$162,6)","v":"TM 57"},{"$f":"LEFT($R$163,6)","v":"TM 112"},{"$f":"LEFT($R$164,6)","v":"TM 116"},{"$f":"LEFT($R$165,6)","v":"Stade "},{"$f":"LEFT($R$166,6)","v":"TM 72"},{"$f":"LEFT($R$167,6)","v":"TM 69"},{"$f":"LEFT($R$168,6)","v":"TM 148"},{"$f":"LEFT($R$169,6)","v":"TM 150"},{"$f":"LEFT($R$170,6)","v":"TM 78"},{"$f":"LEFT($R$171,6)","v":"TM 121"},{"$f":"LEFT($R$172,6)","v":"TM 137"},{"$f":"LEFT($R$173,6)","v":"Celtic"},{"$f":"LEFT($R$174,6)","v":"TM 125"},{"$f":"LEFT($R$175,6)","v":"TM 63"},{"$f":"LEFT($R$176,6)","v":"TM 44"},{"$f":"LEFT($R$177,6)","v":"FC Bar"},{"$f":"LEFT($R$178,6)","v":"FC Ars"},{"$f":"LEFT($R$179,6)","v":"TM 141"},{"$f":"LEFT($R$180,6)","v":"TM 119"},{"$f":"LEFT($R$181,6)","v":"TM 74"},{"$f":"LEFT($R$182,6)","v":"TM 41"},{"$f":"LEFT($R$183,6)","v":"TM 92"},{"$f":"LEFT($R$184,6)","v":"Manche"},{"$f":"LEFT($R$185,6)","v":"Roter "},{"$f":"LEFT($R$186,6)","v":"TM 68"},{"$f":"LEFT($R$187,6)","v":"Atleti"},{"$f":"LEFT($R$188,6)","v":"FC Lil"},{"$f":"LEFT($R$189,6)","v":"TM 101"},{"$f":"LEFT($R$190,6)","v":"TM 167"},{"$f":"LEFT($R$191,6)","v":"TM 49"},{"$f":"LEFT($R$192,6)","v":"TM 165"},{"$f":"LEFT($R$193,6)","v":"TM 113"},{"$f":"LEFT($R$194,6)","v":"FC Bay"},{"$f":"LEFT($R$195,6)","v":"TM 98"},{"$f":"LEFT($R$196,6)","v":"Young "},{"$f":"LEFT($R$197,6)","v":"Real M"},{"$f":"LEFT($R$198,6)","v":"TM 171"},{"$f":"LEFT($R$199,6)","v":"TM 180"},{"$f":"LEFT($R$200,6)","v":"TM 158"},{"$f":"LEFT($R$201,6)","v":"TM 111"},{"$f":"LEFT($R$202,6)","v":"TM 172"},{"$f":"LEFT($R$203,6)","v":"TM 60"},{"$f":"LEFT($R$204,6)","v":"TM 106"},{"$f":"LEFT($R$205,6)","v":"TM 136"}]
[null,1,"Real Madrid",null,null,null,1,{"$f":"spielpaarungen(200,TRUE,TRUE)","v":137},35,{"$f":"IFERROR(VLOOKUP($H6,$B$6:$C$205,2,0),\"\")","v":"TM 137"},"-",{"$f":"IFERROR(VLOOKUP($I6,$B$6:$C$205,2,0),\"\")","v":"Eintracht Frankfurt"},3,":",4,null,{"$f":"Gruppentabelle(0,3,$J$6:$J$1265,$L$6:$L$1265,$M$6:$M$1265,$O$6:$O$1265,$C$6:$C$205,$D$6:$D$205,$E$6:$E$205)","v":1},"TM 173",13,9,2,2,33,":",14,19,29,"","TM 173","","","","","","","","","","","","","","","","","","","","","","","","","","","","","","","","","","","","","","","","","","","","","","","","","","","","","","","","","","","","","","","","","","","","","","","","","","","","","","","","","","","","","","","","","","","","","","","","","","","","","1 : 0","","","","","","","","","","","","","","","","","","","","","","","","","","","","","","","","","","","","","","","","","","","0 : 3","","","","","","","","","","","0 : 0","","","","5 : 2","","","9 : 2","","","","","","","","","","","","","3 : 1","1 : 3","","","","","5 : 2","","","0 : 0","","1 : 0","","","","","3 : 0","","3 : 1","","","","","2 : 0","","","","","","",""]
[null,2,"Manchester City",null,null,null,2,33,161,{"$f":"IFERROR(VLOOKUP($H7,$B$6:$C$205,2,0),\"\")","v":"Sturm Graz"},"-",{"$f":"IFERROR(VLOOKUP($I7,$B$6:$C$205,2,0),\"\")","v":"TM 161"},0,":",3,null,2,"TM 120",13,9,1,3,40,":",22,18,28,"","TM 120","","","","","","","","","","","","","","","","","","","","","","","","","","","","","","","","","","","","","","","","","","","","","","","","","","","","","","","","","","","","","","","","","","","","","","","","","","","","1 : 5","","","","","","","","","","","","","","","","","","","","","","","","","","","","","","","","","","","","","","","","","","","","","","1 : 0","","","","","","2 : 1","5 : 2","","9 : 2","","","","","","","","","","5 : 2","","","","","","","","0 : 4","2 : 0","","","","","","3 : 1","","","","","","","","","","","","","3 : 0","0 : 3","","","","","","","","","","","","","","","","","","","","","","0 : 0","","","","9 : 2","","","","","","","","",""]
[null,3,"FC Bayern München",null,null,null,3,138,32,"TM 138","-","VfB Stuttgart",9,":",2,null,3,"Aston Villa",13,9,1,3,34,":",18,16,28,"","Aston Villa","","","","","","","","","","","","","","","","","","","","","","","","","","","","","","","","","","","","","","","","","","","","","","","","","","","","","","","","","","","","","","","","","","","","","","","","","","","","","","","","","","","","","","","","","","","","","","","","","","","","","","","","","","","","","","","","","","1 : 0","","","","","","","9 : 2","","","","","","","","","","","","","","","","","","","","","","","1 : 0","","","","","","","","","","","2 : 0","","","","","","","0 : 3","","","","","","","","","","","","","5 : 2","2 : 1","","","","","0 : 4","","","2 : 0","","3 : 1","","","","","0 : 0","","9 : 2","","","","","0 : 3","","","","","","",""]
[null,4,"Paris Saint-Germain",null,null,null,4,31,146,"FC Girona","-","TM 146",3,":",1,null,4,"TM 89",13,9,1,3,34,":",24,10,28,"","TM 89","","","","","","","","","","","","","","","","","","","","","","","","","","","","","","","","","","","","","","","","","","","","","","","","","","","","","","","","","","","","","","","","","","","","","","","","","","","","3 : 0","","","","2 : 9","","","","","","3 : 1","","","","","","","","0 : 0","1 : 0","","","","","","","","","","","","","","","","","","","","","5 : 2","","","","","","","","","","","","1 : 0","9 : 2","","","","","","","","","","","","","","","","","","","","","","","","","","","","","","","","","","","","0 : 3","","","","","5 : 2","","","","","","","","","","","","","","","","","","3 : 1","","","","0 : 4","","","","2 : 0","","","","","","","","",""]
[null,5,"FC Liverpool",null,null,null,5,47,23,"TM 47","-","Dinamo Zagreb",1,":",3,null,5,"TM 199",13,9,0,4,40,":",23,17,27,"","TM 199","","","","","","","","","","","","","","","","","","","","","","","","","","","","","","","","","","","","","","","","","","","","","","","","","","","","","","","","","","","","","","","","","","","","","","","","","","","","","","","","","","","","","","","","0 : 3","","","","","","","","","","","","","","","","","","","","","0 : 4","","","","","","","","5 : 1","","","","","","","","2 : 0","","","","","","","","","","","","","","","0 : 3","","","","","","","","","","","9 : 2","","","","","","","","","","5 : 2","","","","","","","3 : 1","","","","","","","","","","","","","","","","","","","","","","","","","","","2 : 1","","","","1 : 0","","","","","3 : 1",""]
[null,6,"Inter Mailand",null,null,null,6,21,153,"PSV Eindhoven","-","TM 153",2,":",0,null,6,"TM 56",12,8,2,2,34,":",15,19,26,"","TM 56","","","","","","","","","","","","","","","","","","","","","","","","","","","","","","","","","","","","","","","","","","","","","","","","","","","","","","","","","","","","","","","","","","","","","","","","","","","","","","","","","","","","","","","","","","","","","","","","","1 : 0","","","","","","","","","","","","","","","","","","0 : 0","","","","","","","","","","","","","","","","","","","","2 : 1","","","","5 : 2","","","","","","","","3 : 1","","","","","","","","","","","","","","","","0 : 0","","","","","","","","","","0 : 3","","","","9 : 2","","","3 : 0","","5 : 1","","","1 : 3","","","","","","","","","","","","5 : 2","","","","","","","",""]
[null,7,"Borussia Dortmund",null,null,null,7,42,18,"TM 42","-","AC Mailand",0,":",0,null,7,"TM 94",13,8,2,3,37,":",21,16,26,"","TM 94","","","","","","","","","","","","","","","","","","","","","","","","","","","","","","","","","","","","","","","","","","","","","","","","","","","","","","","","","","","","","","","","","","","","","","","","","","","","0 : 3","","","","","","","","","","","","","","","","","","","","","","","","","","","","","","","","","","","","","","","","","","","","","","","","","","","","1 : 3","3 : 1","","2 : 1","","","","","","","","","","","","","","","","","","5 : 2","0 : 0","","","","","","1 : 5","","","","","","","","","5 : 2","","","","9 : 2","5 : 1","","","","","","","","","","","","","","","","","","0 : 0","","","","3 : 0","","","","3 : 1","","","","","","","","",""]
[null,8,"RB Leipzig",null,null,null,8,17,43,"Schachtjor Donezk","-","TM 43",3,":",0,null,8,"TM 83",13,8,2,3,29,":",13,16,26,"","TM 83","","","","","","","","","","","","","","","","","","","","","","","","","","","0 : 1","","","","","","","","","","","","","","","","","","","","","","","","","","","","","","","","9 : 2","","","","3 : 1","0 : 0","","","","","","","","","","","","","","","","","","","","","","","","","","","","","","","","","","","","4 : 0","","","","","","","","","","","","","","3 : 1","","","","","0 : 3","","3 : 0","","2 : 0","","","","","","","","","","","","","","","","","","","","","","","","","","","","","","","","2 : 5","","","","","","","1 : 0","","","","","","","","","","","","","","","","","","","0 : 0","","","","","2 : 0","","","","","","","","","","","","","","","","","","",""]
[null,9,"FC Barcelona",null,null,null,9,177,117,"TM 177","-","TM 117",0,":",0,null,9,"TM 142",13,8,2,3,29,":",17,12,26,"","TM 142","","","","","","","","","","","","","","","","","","","","","","","","","","","","","","","","","","","","","","","","","","","","","","","","","","","","","","","","","","","","","","","","","","","","","","","","","","","","","","","","","","","","","","","","","","","","","","","","","","","","","0 : 3","","","","","","","","","","","","","","","","","","","","","","","","","","3 : 1","","","","","","5 : 2","","","","","","","","","","","5 : 1","","","","","","","","","","","","","","","3 : 1","","","3 : 1","","","","","","","","","","","","","1 : 0","5 : 2","","","","","","","","3 : 0","","0 : 3","","","","","0 : 0","","1 : 3","","","","","0 : 0","","","","","","",""]
[null,10,"Bayer Leverkusen",null,null,null,10,191,150,"TM 191","-","TM 150",1,":",2,null,10,"TM 134",13,8,2,3,28,":",17,11,26,"","TM 134","","","","","","","","","","","","","","","","","","","","","","","","","","","","","","","","","","","","","","","","","","","","","","","","","","","","","","","","","","","","","","","0 : 3","","","","","","","","","","","","","","","","","","","","","","","","","","","","","","","","","","","","","3 : 1","","","","","","","","","","","","","","5 : 2","","","","","","","1 : 0","","","","","","","","","","","","","","","","","","","","","","","","","","","","","","","","","","1 : 3","","","","","","","5 : 1","","","","","","","","","","","","","2 : 1","0 : 3","","","","","0 : 0","","","","","3 : 0","","","","","5 : 2","","","","","","","3 : 1","","","","","","",""]
[null,11,"Atletico Madrid",null,null,null,11,140,190,"TM 140","-","TM 190",0,":",3,null,11,"TM 166",13,8,1,4,41,":",22,19,25,"","TM 166","","","","","","","","","","","","","","","","","","","","","","","","","","","","","","","","","","","","","","","","","","1 : 3","","","","","","","","","","","","","","","","","","","","","","","","","","","","","","","","","","","","","","","","","","","","","","3 : 1","","","","","","","","","","","","","","","","","","","","","2 : 0","","0 : 4","","","","","","1 : 3","","","","","","","","0 : 3","","","","","","","","","","","","","","","5 : 1","","","","","","","","","","","","","","","","","","","","","0 : 0","","","","","","","9 : 2","","","","","","","","","","","","","","","","","","","3 : 1","","","","","","","","5 : 2","","","","9 : 2","","","","","3 : 0",""]
[null,12,"Atalanta Bergamo",null,null,null,12,188,126,"TM 188","-","TM 126",5,":",1,null,12,"TM 144",13,8,1,4,35,":",19,16,25,"","TM 144","","","","","","","","","","","","","","","","","","","","","","","","","","","","","","","","","","","","","","","","","","","","","","","","","","","","","","","","","","","","","","","","","","","","","","","","","","","","","","","","","","","","","","","","","","","","","","","","","","","","","","","","","","","","","","","","","","","","","","","","","5 : 1","","","","","","","","","","","","","","","","","","","","","","","1 : 3","","","","","","","","","","","3 : 1","","","","3 : 0","","","3 : 0","","","","","","","","","","","","","2 : 0","0 : 4","","","","","1 : 3","","","5 : 1","","3 : 1","","","","","0 : 3","","0 : 0","","","","","9 : 2","","","","","","",""]
[null,13,"Juventus Turin",null,null,null,13,38,116,"FC Basel","-","TM 116",0,":",4,null,13,"TM 76",12,8,1,3,33,":",18,15,25,"","TM 76","","","","","","","","","","","","","","","","","","","","","","","","","","","","","","","","","","","","","","","","","","","","","","","","","","","","","","","","","","","","","","","","","","","","","","","","","","","","","","","","","","","","","","","","","","","","","","","","","","","","","","","","","","","","","","","","0 : 4","","","","","","","","","","","","3 : 1","","","","","","","","3 : 0","","","1 : 0","","","","","","","","","","","","0 : 0","","","","","","3 : 1","","","","","","","","","","1 : 3","","","","","","","","","","5 : 2","3 : 1","","","","","","","","","0 : 3","","","","","","","","","","","","","","9 : 2","","","","5 : 1","","","",""]
[null,14,"Benfica Lissabon",null,null,null,14,115,78,"TM 115","-","TM 78",5,":",2,null,13,"TM 87",13,8,1,4,33,":",18,15,25,"","TM 87","","","","","","","","","","","","","","","","","","","","","","","","","","","","","","","","","","","","","","","","","","","","","","","","","","","","","","","","","","","","","","5 : 1","","","","","","","","","","","","","","3 : 0","","","","0 : 0","","","","","","0 : 4","","","","","","","","3 : 0","3 : 1","","","","","","","","","","","","","","","","","","","","","2 : 0","","","","","","","","","","","","0 : 3","5 : 1","","","","","","","","","","","","","","","","","","","","","","","","","","","","","","","","","","","","9 : 2","","","","","","","","","","","","","","","","","","","","","","","1 : 0","","","","1 : 3","","","","1 : 3","","","","","","","","",""]
[null,15,"FC Arsenal",null,null,null,15,71,20,"TM 71","-","Sporting Lissabon",3,":",1,null,15,"TM 122",12,8,1,3,27,":",15,12,25,"","TM 122","","","","","","","","","","","","","","","","","","","","","","","","","","","","","","","","","","","","","","","","","","","","","","","","","","","","","","","","","","","","","","","","","","","","","","","","","","","","","","","","","","","","","","","","","","","","","","","","","","","","","","","","","","","","","","","","","","","","","","","","","","","","5 : 2","","","","","","","","0 : 0","","","3 : 1","","","","","","","","","","","","2 : 0","","","","","","","","","","","","","","","","3 : 1","","","","","","","","","","0 : 4","0 : 2","","","","","","1 : 0","","9 : 2","1 : 0","","","","","","","","","","","","","","3 : 0","","","","0 : 3","","","",""]
[null,16,"FC Brügge",null,null,null,16,109,45,"TM 109","-","TM 45",0,":",3,null,16,"TM 91",13,8,1,4,37,":",26,11,25,"","TM 91","","","","","","","","","","","","","","","","","","","","","","","","","","","","","","","","","","","","","","5 : 2","","","","","","","","","","","","","","","","","","","","","","","","5 : 0","","","","","","","","","","","","","","2 : 9","","","","1 : 3","","","","","","1 : 3","","","","","","","","3 : 0","5 : 2","","","","","","","","","","","","","","","","","","","","","1 : 3","","","","","","","","","","","","","3 : 1","","","","","","","","","","","","","","","","","","","","","","","","","","","","","","","","","","","","5 : 1","","","","","","","","","","","","","","","","","","","","","","","1 : 0","","","","5 : 2","","","","0 : 0","","","","","","","","",""]
[null,17,"Schachtjor Donezk",null,null,null,17,199,107,"TM 199","-","TM 107",9,":",2,null,17,"TM 71",13,8,1,4,31,":",22,9,25,"","TM 71","","","","","","","","","","","","","","","","","","","","","","","","","","","","","","","","","","","","","","","","","","","","","","","","","","","","","","","","","","","","","","","","","","","","","","","","","","","","","","","","","","","","","","","","3 : 1","","","","","","","","","","","","","","","","","","","","","9 : 2","","","","","","","","0 : 3","","","","","","","","0 : 4","","","","","3 : 1","","","","","","","","","","0 : 0","","","","","","","","","","","1 : 0","","","","","","","","","","2 : 1","","","","","","","3 : 0","","","","","","","","","","","","","","","","","","","5 : 1","","","","","","","","0 : 3","","","","5 : 2","","","","","0 : 4",""]
[null,18,"AC Mailand",null,null,null,18,12,95,"Atalanta Bergamo","-","TM 95",2,":",1,null,18,"TM 185",13,8,1,4,27,":",18,9,25,"","TM 185","","","","","","","","","","","","","","","","","","","","","","","","","","","","","","","","","","","","","","","","","","","","","","","","","","","","","","","","","","","","5 : 1","","","","","","","","","","","","","","","","","","","","","","","","","","","","","","","","","","","","","","","","","","","","","","","","","","","","","","","","","","","","","","3 : 1","","","","","","5 : 1","1 : 3","","0 : 3","","","","","","","","","","3 : 0","","","","","","","","2 : 1","2 : 0","","","","","","0 : 0","","","","","","","","","","","","","0 : 4","0 : 3","","","","","","","","","","","","","","","","","","","","","","3 : 1","","","","3 : 0","","","","","","","","",""]
[null,19,"Feyenoord Rotterdam",null,null,null,19,166,187,"TM 166","-","TM 187",1,":",3,null,19,"TM 132",13,8,1,4,28,":",20,8,25,"","TM 132","","","","","","","","","","","","","","","","","","","","","","","","","","","","","","","","","","","","","","","","","","","","","","","","","","","","","","","","","","","","","","","","","","","","","","","","","","","","","","","","","","","","","","","","","","","","","","","","","","","","","","","","","","","","","","","","","","3 : 1","","","","","3 : 0","","0 : 3","","","","","","","","","","","","","","","","","","","","","","","3 : 1","","","","","","","","","","","5 : 2","","","","","","","0 : 4","","","","","","","","","","","","","1 : 3","5 : 1","","","","","2 : 1","","","","","0 : 0","","","","","3 : 1","","3 : 0","","","","","0 : 3","","","","","","",""]
[null,20,"Sporting Lissabon",null,null,null,20,186,165,"TM 186","-","TM 165",2,":",0,null,20,"TM 88",13,7,3,3,28,":",17,11,24,"","TM 88","","","","","","","","","","","","","","","","","","","","","","","","","","","","","","","","","","","","","","","","","","","","","","","","","","","","","","","","","","","","","","","","","","","","","","","","","","","","","","","","","","","","","","","","","","","","","","","","","","","","","","3 : 0","","","","","","","","","","","","","","","","9 : 2","","","","","","","","0 : 3","","","","","","","","","","","2 : 1","0 : 0","","","","","","","","","","","","","","1 : 0","","","","","0 : 0","","","3 : 1","","","","","","5 : 1","0 : 0","","","","","","","","","","","","","","","","","","","","","","","","","","","0 : 4","","","","","","0 : 3","","5 : 2","","",""]
[null,21,"PSV Eindhoven",null,null,null,21,73,98,"TM 73","-","TM 98",0,":",0,null,21,"TM 42",13,7,3,3,25,":",15,10,24,"","TM 42","","","","","","","","","","","","","","","","","","","","","","","","","","","","","","","","","","","","","","","","","","","","","","","","","","","","","","","","","","","","","","","","","","","","","","","","","","","4 : 0","","","","","","","","","","","","","","","","","","","","","","","","","","","","","","","","","","1 : 3","","","","3 : 0","","","","1 : 0","","","","","","","","3 : 1","","","","","0 : 0","","","","0 : 0","","","","","","","","","","","","","","","","","3 : 1","","","","","","","","","","2 : 0","","","2 : 5","","","","","","","","","","","","","","","","","","","","","","","5 : 2","","","","","","","","1 : 3","","","","","","","","","0 : 0",""]
[null,22,"Celtic Glasgow",null,null,null,22,185,27,"TM 185","-","Young Boys Bern",3,":",0,null,22,"TM 157",13,7,3,3,24,":",17,7,24,"","TM 157","","","","","","","","","","","","","1 : 0","","","","","","","","","","","","","","","","3 : 1","","","","","","","","","","","","","1 : 3","","0 : 3","","","","","","","","","","","","","","","","","","","","","","","","","","","","","","","","","","","","","","","","","","","","0 : 0","","","","","","","","","","","","","","","","","","","","","","","0 : 0","","","","","","","","","","","","","","5 : 1","","","","","","","","","","","","","","","5 : 2","","","","","","","","","","","","","","","","","","","","","2 : 0","","","","","","","","","","","","","","","","","","","","","","","","","","4 : 3","","","","","","","","","","","","3 : 0","","","","","0 : 0",""]
[null,23,"Dinamo Zagreb",null,null,null,23,168,97,"TM 168","-","TM 97",0,":",0,null,23,"TM 85",13,7,3,3,24,":",20,4,24,"","TM 85","","","","","","","","","","","","","","","","","","","","","","","","","","","","","","","","","","","3 : 1","","","0 : 0","","","","","","","","","","","","","","","","","","","","","","","","0 : 4","","","","","","","","","","","","","","0 : 0","","","","1 : 0","","","","","","5 : 2","","","","","","","","2 : 9","0 : 2","","","","","","","","","","","","","","","","","","","","","0 : 0","","","","","","","","","","","","","","","","","","","","","","","","","","","","","","","","","","","","","","","","","","","","","","","","","5 : 1","","","","","","","","","","","","","","","","","","","","","","","3 : 1","","","","2 : 0","","","","3 : 0","","","","","","","","",""]
[null,24,"Red Bull Salzburg",null,null,null,24,120,24,"TM 120","-","Red Bull Salzburg",1,":",5,null,24,"TM 174",13,7,2,4,32,":",16,16,23,"","TM 174","","","","","","","","","","","","","","","","","","","","","","","","","","","1 : 3","","","","","","","","","","","","","","","","","","","","","","","","","","","","","","","","0 : 0","","","","3 : 1","","","","","","","","","","","","","","","","","","","","","","","","","","","","","","","","","","","","","3 : 0","","","","","","","","","","","","","","0 : 1","","","","","9 : 2","","2 : 0","","1 : 5","","","","","","","","","","","","","","","","","","","","","","","","","","","","","","","","0 : 0","","","","","","","1 : 3","","","","","","","","","","","","","","","","","","","4 : 0","","","","","5 : 1","","","","","","","","","","","","3 : 0","","","","","","",""]
[null,25,"OSC Lille",null,null,null,25,157,11,"TM 157","-","Atletico Madrid",4,":",3,null,25,"TM 96",12,7,2,3,31,":",17,14,23,"","TM 96","","","","","","","","","","","","","","","","","","","","","","","","","","","","","","","","","","","","","","","","","","","","","","","","","","","","","","","","","","","","","","","","","","","","","","","","","","","","","","","","","","","","","","","","","","","","","","","","","","","","","","","","","","","","","","5 : 2","","0 : 4","","","","","","","","","","","","","","","","","","","","","","","","0 : 0","","","","","","","","","","","","1 : 0","","","","","0 : 0","5 : 1","","","","","","","","","","","","","","","","","0 : 3","","","3 : 0","","","","9 : 2","","","","","","","","","","","3 : 1","","","","","","","","","","","","","","5 : 1","","0 : 3"]
[null,26,"Roter Stern Belgrad",null,null,null,26,184,39,"TM 184","-","FC Lille",5,":",1,null,26,"Inter Mailand",13,7,2,4,30,":",17,13,23,"","Inter Mailand","","","","","","","","","","","","","","","","","","","","","","","","","","","","","","","","","","","","","","","","","","","","","","","","","","","","","","","","","","","","","","","1 : 3","","","","","","","","","","","","","","","","","","","","","","","","","","","","","","","","","","","","","0 : 0","","","","","","","","","","","","","","3 : 0","","","","","5 : 1","","0 : 0","","4 : 0","","","","","","","","","","","","","","","","","","","","","","","","","","","","","","","","1 : 0","","","","","","","2 : 0","","","","","","","","","","","","","5 : 1","0 : 3","","","","","2 : 5","","","","","0 : 4","","","","","","","","","","","","7 : 0","","","","","","",""]
[null,27,"Young Boys Bern",null,null,null,27,192,93,"TM 192","-","TM 93",0,":",4,null,27,"TM 128",12,7,2,3,27,":",14,13,23,"","TM 128","","","","","","","","","","","","","","","","","","","","","","","","","","","","","","","","","","","","","","","","","","","","","","","","","","","","","","","","","","","","","","","","","","","","","","","","","","","","","","","","","","","","","","","","","","","","","","","","","","","","","","","","","","","","","","0 : 3","","","","","","","","","","","","","","","","","","","","","","","","","","2 : 0","","","","","","","1 : 3","","","","","0 : 0","","","","","3 : 1","0 : 0","","","","","","","","","","","","","","","","","0 : 4","","","","","","","3 : 0","","","","","","","","","","","5 : 1","1 : 0","","","","","","","","","","","","","9 : 2","","3 : 0"]
[null,28,"AS Monaco",null,null,null,28,94,34,"TM 94","-","Stade Brest",5,":",2,null,28,"Juventus Turin",12,7,2,3,25,":",12,13,23,"","Juventus Turin","","","","","","","","","","","","","","","","","","","","","","","","","","","","","","","","","","","","","","","","","","","","","","","","","","","","","","","","","","","","","","","","","","","","","","","","","","","","","","","","","","","","","","","","","","","","","","","","","","","","","","","","","","","","","","","","0 : 3","","","","","","","","","","","","1 : 3","","","","","","","","0 : 0","","","","","","","","","","","","","","","","","","","","","1 : 3","1 : 0","","","","","","","","","","","","","","","","","3 : 0","","","2 : 0","","","","0 : 0","","","","","2 : 0","","","","","","","","","","","","","","","","","","3 : 0","","3 : 1","","9 : 2"]
[null,29,"Aston Villa",null,null,null,29,129,30,"TM 129","-","FC Bologna",3,":",1,null,29,"TM 58",12,7,2,3,29,":",17,12,23,"","TM 58","","","","","","","","","","","","","","","","","","","","","","","","","","","","","","","","","","","","","","","","","","","","","","","","","","","","","","","","","","","","","","","","","","","","","","","","","","","","","","","","","","","","","","","","","","","","","","","","","","","","","","","","","","","","","","","","3 : 1","","","","","","","","","","","","1 : 3","","","","","","","","5 : 2","","","","","","","","","","","","","","","","2 : 0","","","","","0 : 0","9 : 2","","","","","","","","","","","","","","","","","3 : 1","","","3 : 1","","","","0 : 3","","","","","0 : 4","","","","","","","","","","","","","","","","","","","","3 : 0","","0 : 0"]
[null,30,"FC Bologna",null,null,null,30,160,162,"TM 160","-","TM 162",0,":",3,null,30,"Benfica Lissabon",13,7,2,4,30,":",19,11,23,"","Benfica Lissabon","","","","","","","","","","","","","","","","","","","","","","","","","","","","1 : 3","","","","","","","","","","","","","","","","","","","","","","","","","","","","","","","","","","","","","","0 : 3","","","","","","","","","","","","","","","","","","","","","","","","","","","","","","","","","","","","1 : 3","","","","","","","","","","","","","","","","5 : 2","","","","","","","","0 : 4","","","","","","","","","","","0 : 0","2 : 0","","","","","","","","","","","","","","0 : 0","","","","","3 : 1","","","5 : 1","","","","","","9 : 2","","","","","","","","","","","","","","","","","","","","","","","","","","","","1 : 0","","","","","","3 : 0","","","","",""]
[null,31,"FC Girona",null,null,null,31,147,106,"TM 147","-","TM 106",9,":",2,null,31,"Hertha BSC",12,7,2,3,27,":",16,11,23,"","Hertha BSC","","","","","","","","","","","","","","","","","","","","","","","","","","","","","","","","","","","","","","","","","","","","","","","","","","","","","","","","","","","","","","","","","","","","","","","","","","","","","","5 : 2","","","","","","","","","","","","","","","","","","","","","","","","1 : 0","","","","","","","","","","","","","","","","0 : 3","","","","","","","","3 : 1","","","","","","","","","","","9 : 2","","","","","","","","","","","","","","","","","","","","0 : 0","","","","","","","","","3 : 0","1 : 3","","","","","","","","","","","","2 : 0","","","","","","","","","","","","","","","3 : 1","","","","","","0 : 0","","0 : 4","","",""]
[null,32,"VfB Stuttgart",null,null,null,32,159,36,"TM 159","-","Mainz 05",3,":",1,null,32,"Atalanta Bergamo",13,7,2,4,29,":",19,10,23,"","Atalanta Bergamo","","","","","","","","","","","","","","","","","","","","","","","","","","","","","","","","","","","","","","","","","","","","","","","","","","","","","","","","","","","","0 : 3","","","","","","","","","","","","","","","","","","","","","","","","","","","","","","","","","","","","","","","","","","","","","","","","","","","","","","","","","","","","","","5 : 2","","","","","","0 : 3","2 : 1","","4 : 0","","","","","","","","","","0 : 0","","","","3 : 0","3 : 1","","","0 : 0","1 : 3","","","","","","3 : 0","","","","","","","","","","","","","5 : 1","3 : 5","","","","","","","","","","","","","","","","","","","","","","","","","","","","","","","","","","",""]
[null,33,"Sturm Graz",null,null,null,33,182,148,"TM 182","-","TM 148",1,":",3,null,32,"TM 108",13,7,2,4,29,":",19,10,23,"","TM 108","","","","","","","","","","","","","","","","","","","","","2 : 5","","","","","","","0 : 0","","","","","","","","","","","","","","","","","","","","","","","","","","","","","","","","","","","","","","3 : 1","","","","","","","","","","","","","","","","","","","","","","","","","","","","","","","","","","","","","","","","","","","","","","","","","","","","3 : 1","","","","","","","","2 : 0","","","","","","","","","","","0 : 3","1 : 0","","","","","","","","","","","","","","0 : 3","","","","","3 : 0","","","1 : 3","","","","","","0 : 0","","","","","","","","","","","","","","","","","","","","","","","","","","","","9 : 2","","","","","","5 : 1","","","","",""]
[null,34,"Stade Brest",null,null,null,34,183,84,"TM 183","-","TM 84",2,":",0,null,34,"TM 75",13,7,2,4,28,":",20,8,23,"","TM 75","","","","","","","","","","","","","","","","","","","","","","","","","","","","","","","","","","","","","","","","","","","","","","","","","","","","","","","","","","","","","","","2 : 0","","","","","","","","","","","","","","","","","","","","","","","","","","","","","","","","","","","","","","","","","","","","","","","","","","","0 : 0","","","","","0 : 4","","0 : 3","","","","","","","","","","","","","","","","","","","","","","","","","","","","","","","","","","0 : 3","","","","","","","0 : 0","","","","","","","","","","","","","0 : 4","9 : 2","","","","","5 : 1","","","","","5 : 2","","","","","2 : 0","","4 : 1","","","","","1 : 0","","","","","","",""]
[null,35,"Eintracht Frankfurt",null,null,null,35,194,180,"TM 194","-","TM 180",6,":",0,null,35,"TM 70",13,7,2,4,27,":",19,8,23,"","TM 70","","","","","","","","","","","","","","","","","","","","","","","","","","","","","","","","","","","","","","","","","","","","","","","","","","","","","","","","","","","","","","","","","","","","","","","","","","","","","3 : 0","","","","","","","","","","","","","","","","","","","","","","","","9 : 2","","","","","","","","","","","","","","","","","","","","","","","","","","0 : 4","","","","","","2 : 0","","","","","","","","","","","0 : 0","","","","","","","","","","","","","","","1 : 0","","","","","","","","","","","","","","","","0 : 3","0 : 0","","","","","","","","5 : 2","","2 : 0","","","","","5 : 1","","0 : 3","","","","","0 : 4","","","","","","",""]
[null,36,"Mainz 05",null,null,null,36,8,99,"RB Leipzig","-","TM 99",3,":",0,null,36,"TM 159",13,7,2,4,26,":",18,8,23,"","TM 159","","","","","","","","","","","","","","","","","","","","","","","","","","","","","","","","","","","","","","","","","","","","","","","","","","","","","","","","","","","","","","","","","","","","","","","","","","","","5 : 1","","","","","","","","","","0 : 3","","","","","","","","","","","","","","","","","","","","","","","","","","","","","","3 : 1","","","","","","","","","","","","5 : 2","0 : 3","","","","","","","","","","","","","","","","","","","","","3 : 0","","","","","","0 : 3","","","","","","","","","3 : 1","","","","3 : 1","0 : 0","","","","","","","","","","","","","","","","","","3 : 0","","","","0 : 0","","","","1 : 3","","","","","","","","",""]
[null,37,"AC Roma",null,null,null,37,16,110,"FC Brügge","-","TM 110",0,":",0,null,37,"TM 86",13,7,2,4,24,":",16,8,23,"","TM 86","","","","","","","","","","","","","","","","3 : 1","","","","","","","","","","","3 : 1","","","","","","","","","","","","","","","","","","","","","","","","","","","","","","","","0 : 3","","","","0 : 2","3 : 1","","","","","","","","","","","","","","","","","","","","","","","","","","","","","","","","","","","","4 : 0","","","","","","","","","","","","","","0 : 0","","","","","0 : 3","","1 : 3","","3 : 0","","","","","","","","","","","","","","","","","","","","","","","","","","","","","","","","3 : 0","","","","","","","3 : 1","","","","","","","","","","","","","","","","","","","1 : 1","","","","","","","","","","","","","","","","","","","","","","","",""]
[null,38,"FC Basel",null,null,null,38,89,163,"TM 89","-","TM 163",1,":",0,null,38,"TM 186",13,7,2,4,23,":",19,4,23,"","TM 186","","","","","","","","","","","","","","","","","","","","","","","","","","","","","","","","","","","","","","","","","","","","","","","","","","","","","","","","","","","","2 : 0","","","","","","","","","","","","","","","","","","","","","","","","","","","","","","","","","","","","","","","","","","","","","","","","","","","","","","","","","","","","","","0 : 0","","","","","","9 : 2","0 : 4","","0 : 3","","","","","","","","","","0 : 4","","","","","1 : 0","","","3 : 1","0 : 3","","","","","","5 : 2","","","","","","","","","","","","","0 : 0","1 : 0","","","","","","","","","","","","","","","","","","","","","","2 : 0","","","","","","","","","","","","",""]
[null,39,"FC Lille",null,null,null,39,74,7,"TM 74","-","Borussia Dortmund",0,":",3,null,39,"Feyenoord Rotterdam",13,7,2,4,22,":",19,3,23,"","Feyenoord Rotterdam","","","","","","","","","","","","","","","","","","","","","","","","","","","3 : 0","","","","","","","","","","","","","","","","","","","","","","","","","","","","","","","","","","","","1 : 0","","","","","","","","","","","","","","","","","","","","","","","","","","","","","","","","","","","","","2 : 5","","","","","","","","","","","","","","1 : 3","","","","","2 : 0","","1 : 5","","0 : 0","","","","","","","","","","","","","","","","","","","","","","","","","","","","","","","","3 : 1","","","","","","","0 : 3","","","","","","","","","","","","","","1 : 0","","","","","3 : 0","","","","","0 : 0","","","","","","","","","","","","5 : 2","","","","","","",""]
[null,40,"Hertha BSC",null,null,null,40,87,178,"TM 87","-","TM 178",5,":",1,null,40,"TM 59",12,7,1,4,39,":",23,16,22,"","TM 59","","","","","","","","","","","","","","","","","","","","","","","","","","","","","","","","","","","","","","","","","","","","","","","","","","","","","","","","","","","","","","","","","","","","","","","","","","","","","","","","","","","","","","","","","","","","","","","","","","","","","","","","","","","","","","","","9 : 2","","","","","","","","","","","","1 : 0","","","","","","","","5 : 2","","","0 : 3","","","","","","","","","","","","","","","","","","0 : 3","0 : 3","","","","","","","","","1 : 3","","","","","","","","","","0 : 0","5 : 1","","","","","","","","","9 : 2","","","","","","","","","","","","","","5 : 1","","","","4 : 3","","","",""]
[null,41,"TM 41",null,null,null,41,81,176,"TM 81","-","TM 176",0,":",4,null,41,"TM 164",12,7,1,4,30,":",18,12,22,"","TM 164","","","","","","","","","","","","","","","","","","","","","","","","","","","","","","","","","","","","","","","","","","","","","","","","","","","","","","","","","","","","","","","","","","","","","","","","","","","","","","","","","","","","","","","","","","","","","","","","","","","","","","","","","","","","","","","","1 : 3","","","","","","","","","","","","0 : 0","","","","","","","","0 : 4","","","3 : 1","","","","","","","","","","","","5 : 1","","","","","","","","","","","","","","","","1 : 0","","","","","","","","","","3 : 0","5 : 1","","","","","","1 : 3","","","0 : 3","","","","","","","","","","","","","","9 : 2","","","","2 : 0","","","",""]
[null,42,"TM 42",null,null,null,42,91,108,"TM 91","-","TM 108",5,":",2,null,42,"TM 138",13,7,1,5,32,":",21,11,22,"","TM 138","","","","","","","","","","","","","","","","","","","","","","","","","","","","","","","","","","","","","","","","","","","","","","","","","","","","","","","","","","","","","","","","","","","","","","","","","","","0 : 1","","","","","","","","","","","","","","","0 : 0","","","","","","","","","","","","","","","","","","","0 : 3","","","","1 : 3","","","","3 : 1","","","","","","","","","","","","","2 : 0","","","","3 : 1","","","","","","","","9 : 2","","","","","","","","","1 : 5","","","","","","","","","","9 : 2","","","3 : 0","","","","","","","","","","","","","","","","","","","","","","","0 : 3","","","","","","","","1 : 0","","","","","","","","","",""]
[null,43,"TM 43",null,null,null,43,57,86,"TM 57","-","TM 86",1,":",3,null,43,"OSC Lille",12,7,1,4,31,":",20,11,22,"","OSC Lille","","","","","","","","","","","","","","","","","","","","","","","","","","","","","","","","","","","","","","","","","","","","","","","","","","","","","","","","","","","","","","","","","","","","","","","","","","","","","","3 : 1","","","","","","","","","","","","","","","","","","","","","","","","0 : 3","","","","","","","","","","","","","","","","2 : 0","","","","","","","","1 : 3","","","","","","","","","","","0 : 0","","","","","","","","","","","","","","","0 : 4","","","","","0 : 3","","","","","","","","","3 : 1","5 : 1","","","","","","","","","","","","","","","","","","","","","","","","","","","3 : 0","","","","","","5 : 2","","9 : 2","","",""]
[null,44,"TM 44",null,null,null,44,85,14,"TM 85","-","Benfica Lissabon",3,":",1,null,44,"TM 177",13,6,4,3,24,":",13,11,22,"","TM 177","","","","","","","","","","","","","","","","","","","","","","","","","","","","","","","","","","","","","","","","","","","","","","","","","","","","","","","","","","","","","","","","","","","","","","","","","","","0 : 0","","","","","","","","","","","","","","","","","","","","","","","","","","","","","","","","","","0 : 0","","","","3 : 1","","","","2 : 0","","","","","","","","3 : 0","","","","","1 : 3","","","","","","","","","","","","","","","","","","","","","0 : 3","","","","","","","","","","0 : 3","","","1 : 0","","","","0 : 0","","","","","","","","","","","","","","","","","","","0 : 0","","","","","","","","5 : 1","","","","","","","","","9 : 2",""]
[null,45,"TM 45",null,null,null,45,68,83,"TM 68","-","TM 83",0,":",2,null,45,"AC Roma",12,7,1,4,25,":",15,10,22,"","AC Roma","","","","","","","","","","","","","","","","","","","","","","","","","","","","","","","","","","","","","","","","","","","","","","","","","","","","","","","","","","","","","","","","","","","","","","","","","","","","","","","3 : 0","","","1 : 5","","","","","","","","","","3 : 1","","","","","2 : 0","","","","","","","","","","","","","","","","","","0 : 3","","","","","","","","","","","","","","","","","","","","","","","","0 : 1","","","","","","","","3 : 0","","","","","","","","","","","","","","","","","","","","","","","","","","3 : 1","","","","4 : 0","","","5 : 1","","1 : 3","","","0 : 0","","","","","","","","","","","","","","","","","","","",""]
[null,46,"TM 46",null,null,null,46,175,118,"TM 175","-","TM 118",0,":",0,null,46,"TM 47",13,7,1,5,33,":",24,9,22,"","TM 47","","","","","","","","","","","","","","","","","","","","","","","","","","","","","","","","","","","","","","","","","","","","","","","","","","","","","","","","","","","","","","","","","","","","","","","","","","","2 : 0","","","","","","","","","","","","","","","1 : 3","","","","","","","","","","","","","","","","","","","5 : 1","","","","1 : 5","","","","2 : 5","","","","","","","","1 : 3","","","","","4 : 0","","","","3 : 0","","","","","","","","","","","","","","","","","3 : 0","","","","","","","","","","0 : 4","","","0 : 0","","","","","","","","","","","","","","","","","","","","","","","2 : 1","","","","","","","","9 : 2","","","","","","","","","",""]
[null,47,"TM 47",null,null,null,47,171,174,"TM 171","-","TM 174",0,":",3,null,47,"TM 139",12,7,1,4,31,":",22,9,22,"","TM 139","","","","","","","","","","","","","","","","","","","","","","","","","","","","","","","","","","","","","","","","","","","","","","","","","","","","","","","","","","","","","","","","","","","","","","","","","","","","","","","","","","","","","","","","","","","","","","","","","","","","","","","","","","","","","","","","0 : 0","","","","","","","","","","","","","","","","","","","","","","","","0 : 3","","","","","","","","","","","","9 : 2","","","","","5 : 2","5 : 2","","","","","","","","","","","","","","","","","5 : 1","","","3 : 1","","","","0 : 4","","","","","1 : 0","","","","","","0 : 3","","","","","","","","","","","","","","1 : 3","","2 : 1"]
[null,48,"TM 48",null,null,null,48,10,88,"Bayer Leverkusen","-","TM 88",0,":",0,null,48,"TM 184",13,7,1,5,30,":",21,9,22,"","TM 184","","","","","","","","","","","","","","","","","","","","","","","","","","","","","","","","","","","","","","","","","","","","","","","","","","","","","","","","","","","","","","","","","","","","","","","","","","","","1 : 3","","","","","","","","","","","","","","","","","","","","","","","","","","","","","","","","","","","","","","","","","","","","","","0 : 3","","","","","","0 : 4","2 : 0","","5 : 1","","","","","","","","","","","","","","","","","","1 : 3","3 : 1","","","","","","1 : 0","","","","","","","","","","","","","3 : 0","9 : 2","","","","","","","","","","","","","","","","","","5 : 1","","","","0 : 3","","","","0 : 0","","","","","","","","",""]
[null,49,"TM 49",null,null,null,49,44,19,"TM 44","-","Feyenoord Rotterdam",0,":",1,null,49,"TM 48",12,7,1,4,28,":",20,8,22,"","TM 48","","","","","","","","","","","","","","","","","","","","","","","","","","","","","","","","","","","","","","","","","","","","","","","","","","","","","","","","","","","","","","","","","","","","","","","","","","","","","","","","","","","","","","","","","","","","","","","","","","","","","","3 : 1","","","","","","","","","","","","","","","","0 : 4","","","","","","","","5 : 1","","","","","","","","","","","5 : 2","","","","","","","","","","","","","","","9 : 2","","","","","2 : 0","","","0 : 3","","","","","","1 : 3","0 : 3","","","","","","","","","","","","","","","","","","","","","","","","","","","0 : 0","","","","","","2 : 1","","1 : 0","","",""]
[null,50,"TM 50",null,null,null,50,77,48,"TM 77","-","TM 48",3,":",0,null,50,"RB Leipzig",13,7,1,5,26,":",20,6,22,"","RB Leipzig","","","","","","","","","","","","","","","","","","","","","","","","","","","","","","","","","","","","","","","","","","","","","","","","","","","","","","","","","","","","","","","","","","","","","","","","","","","","0 : 4","","","","3 : 0","","","","","","5 : 1","","","","","","","","1 : 3","","","","","","","","","","","","","","","","","","","","","","1 : 3","","","","","","","","","","","","3 : 1","0 : 3","","","","","","","","","","","","","","","","","","","","","","","","","","","5 : 1","","","","","","","","","0 : 3","","","","","3 : 0","","","","","","","","","","","","","","","","","","0 : 0","","","","3 : 1","","","","2 : 0","","","","","","","","",""]
[null,51,"TM 51",null,null,null,51,63,6,"TM 63","-","Inter Mailand",1,":",5,null,51,"TM 62",12,7,1,4,23,":",17,6,22,"","TM 62","","","","","","","","","","","","","","","","","","","","","","","","","","","","","","","","","","","","","","","","","","","","","","","","","","","","","","","","","","","","","","","","","","","","","","","","","","","","","","","","","","","","","","","","","","","","","","","","","","","","","","","","","","","","","","","","","","","","","","","","","","","","3 : 0","","","","","","","","5 : 1","","","2 : 0","","","","","","","","","","","","0 : 3","","","","","","","","","","","","","","","","0 : 0","","","","","","","","","","0 : 4","","","","","","","3 : 1","","3 : 0","3 : 1","","3 : 1","","","","","","","","","","","","0 : 3","","","","1 : 3","","","",""]
[null,52,"TM 52",null,null,null,52,104,25,"TM 104","-","OSC Lille",4,":",0,null,52,"AS Monaco",12,7,1,4,28,":",24,4,22,"","AS Monaco","","","","","","","","","","","","","","","","","","","","","","","","","","","","","","","","","","","","","","","","","","","","","","","","","","","","","","","","","","","","","","","","","","","","","","","","","","","","","2 : 9","","","","","","","0 : 2","","","","","","","1 : 0","","","","","","","","","","3 : 1","","","","","","","","","","","","","","","","","","","","","","","","","","5 : 2","","","","","","0 : 0","","","","","","","","","","","3 : 0","","","","","","","","","","","","","","","0 : 3","","","","","","","","","","","","","","","","9 : 2","","","","","","","","","3 : 1","","","","","","","0 : 4","","2 : 0","","","","","","","","","","","",""]
[null,53,"TM 53",null,null,null,53,49,134,"TM 49","-","TM 134",2,":",5,null,53,"TM 50",12,7,1,4,21,":",18,3,22,"","TM 50","","","","","","","","","","","","","","","","","","","","","","","","","","","","","","","","","","","","","","","","","","","","","","","","","","","","","","","","","","","","","","","","","","","","","","","","","","","","","","","","","","","","","","","","","","","","","","","","","","","","","","","","","","","","","","0 : 4","","2 : 0","","","","","","","","","","","","","","","","","","","","","","","","0 : 4","","","","","","","5 : 1","","","","","5 : 2","","","","","0 : 3","1 : 3","","","","","","","","","","","","","","","","","0 : 0","","","","","","","1 : 0","","","","","","","","","","","3 : 0","","","","","","","","","","","","","","1 : 0","","3 : 1"]
[null,54,"TM 54",null,null,null,54,145,40,"TM 145","-","Hertha BSC",1,":",3,null,54,"TM 168",13,6,4,3,20,":",17,3,22,"","TM 168","","","","","","","","","","","","","2 : 9","","","","","","","","","","","","","","","","0 : 0","","","","","","","","","","","","","3 : 0","","","","","","","","","","","","","","","","","","","","","","","","","","","","","","","","","","","","","","","","","","","","","","0 : 0","","","","","","","","","","","","","","","","","","","","","0 : 0","","3 : 0","","","","","","","","","","","","","","1 : 3","","","","","","","","","","","","","","","0 : 0","","","","","","","","","","","","","","","","","","","","","1 : 0","","","","","","","2 : 0","","","","","","","","","","","","","","","","","","","3 : 1","","","","","","","","","","","","5 : 1","","","","","0 : 3",""]
[null,55,"TM 55",null,null,null,55,113,75,"TM 113","-","TM 75",1,":",4,null,55,"FC Girona",13,7,1,5,24,":",22,2,22,"","FC Girona","","","","","","","","","","","","","","","","","","","","","","","1 : 5","","","","","","","","","","","","","","3 : 0","","","","","","0 : 2","","","","","","","","","","","","","","","","","","1 : 3","","","","","","","","","","3 : 1","","","","","","","","","","","","","","","","","","","","","","","","","","","","","","","","","","","0 : 0","","2 : 1","","","","","","","","","","","","","","0 : 3","","","","","","","","","3 : 1","","","","","","","","","","3 : 1","","","","2 : 0","5 : 2","","","","","","","","","","","","","","","","","","","","","","","","","","1 : 3","","","","","","","","","","","","","","","","","","","","","","","","","","","","","","","","",""]
[null,56,"TM 56",null,null,null,56,158,46,"TM 158","-","TM 46",2,":",2,null,56,"TM 191",13,7,1,5,21,":",19,2,22,"","TM 191","","","","","","","","","","","","","","","","","","","","","","","","","","","","","","","","","","","","","","","","","","","","","","","","","","","","","","","","","","","","3 : 1","","","","","","","","","","","0 : 2","","","","","","","","","","","","","","","","","","","","","","","","","","","","","","","","","","","3 : 1","","0 : 3","","","","","","","","","","","","","","3 : 1","","","","","","","","","3 : 0","","","","","","","","","","0 : 3","","","","2 : 0","3 : 1","","","0 : 0","2 : 5","","","","","","","","","","","","","","","","","","","1 : 2","","","1 : 0","","","","","","","","","","","","","","","","","","","","","","","","","","","","","","","","",""]
[null,57,"TM 57",null,null,null,57,133,132,"TM 133","-","TM 132",1,":",3,null,57,"TM 178",13,7,1,5,25,":",26,-1,22,"","TM 178","","","","","","","","","","","","","","","","","","","1 : 5","","0 : 5","","","","","","","4 : 0","","","","","","","","","","","","","","","","","","","","","","","","","","","","","","","","","","","","","","3 : 0","","","","","","","","","","","","","","","","","","","","","","","","","","","","","","","","","","","","","","","","","","","","","","","","","","","","1 : 3","","","","","","","","1 : 0","","","","","","","","","","","2 : 0","2 : 5","","","","","","","","","","","","","","3 : 1","","","","","3 : 1","","","0 : 0","","","","","","5 : 2","","","","","","","","","","","","","","","","","","","","","","","","","","","","","","","","","","","","","","",""]
[null,58,"TM 58",null,null,null,58,4,5,"Paris Saint-Germain","-","FC Liverpool",3,":",1,null,58,"TM 147",13,7,0,6,33,":",23,10,21,"","TM 147","","","","","","","","","","","","","1 : 3","","3 : 0","","","","","","","","","","","","","","1 : 3","","3 : 1","","","","","","","","0 : 2","","","2 : 0","","0 : 1","","","","","","","","","","","","","","","","","","","","","","","","","","","","","","","","","","","","","","","","","","","","1 : 3","","","","","","","","","","","","","","","","","","","","","","","5 : 2","","","","","","","","","","","","","","","","","","","","","","","","","","","","","0 : 4","","","","","","","","","","","","","","","","","","","","","","","","","","","","5 : 1","","","","","","","","","","","","","","","","","","","","","","","","","","","","","","","3 : 1","","","","","9 : 2",""]
[null,59,"TM 59",null,null,null,59,2,29,"Manchester City","-","Aston Villa",0,":",2,null,59,"TM 73",13,6,3,4,26,":",17,9,21,"","TM 73","","","","","","","","","","","","","0 : 0","","","","","","","","","","","","","","","","","","","","","","","","","","","","","1 : 3","","","","","","","","","","","","","","","","","","","","","","","","","","","","","","","","","","","","","","","","","","","","","","5 : 2","","","","","","","","","","","","","","","","","","","","","0 : 3","","2 : 0","","","","","","","","","","","","","","0 : 0","","","","","","","","","","","","","","","1 : 3","","","","","","","","","","","","","","","","","","","","","9 : 2","","","","","","","1 : 0","","","","","","","","","","","","","","","","","","","3 : 0","","","","","","","","0 : 0","","","","1 : 3","","","","","3 : 1",""]
[null,60,"TM 60",null,null,null,60,72,66,"TM 72","-","TM 66",0,":",0,null,59,"TM 181",13,6,3,4,26,":",17,9,21,"","TM 181","","","","","","","","","","","","","","","","","","","","","","","","","","","","","","","","","","","","","","","","","","","","","","","","","","","","","","","","","","","","","","","","","","","","","","","","","","","","","","","","","","","","","","","","","","","","","","","","","","","","","0 : 3","","","","","","","","","","","","","","","","","","","","","","","","","","5 : 1","","","","","","","","","","","","","","","","","2 : 0","","","","","","","","","","","0 : 3","","","","0 : 0","","","","","","","","","","","","","","","","0 : 0","3 : 0","","","","","","","","0 : 4","","","","","","","9 : 2","","1 : 0","","","","","5 : 1","","","","","","",""]
[null,61,"TM 61",null,null,null,61,51,144,"TM 51","-","TM 144",0,":",3,null,61,"TM 175",13,6,3,4,24,":",16,8,21,"","TM 175","","","","","","","","","","","","","","","","","","","","","","","","","","","","","","","","","","","3 : 0","","","1 : 3","","","","","","","","","","","","","","","","","","","","","","","","0 : 3","","","","","","","","","","0 : 0","","","","1 : 3","","","","3 : 1","","","","","","5 : 2","","","","","","","","0 : 0","5 : 1","","","","","","","","","","","","","","","","","","","","","3 : 0","","","","","","","","","","","","","","","","","","","","","","","","","","","","","","","","","","","","","","","","","","","","","","","","","0 : 0","","","","","","","","","","","","","","","","","","","","","","","0 : 3","","","","","","","","3 : 0","","","","","","","","",""]
[null,62,"TM 62",null,null,null,62,156,151,"TM 156","-","TM 151",0,":",0,null,62,"TM 46",12,6,3,3,21,":",13,8,21,"","TM 46","","","","","","","","","","","","","","","","","","","","","","","","","","","","","","","","","","","","","","","","","","","","","","","","","","","","","","","","","","","","","","","","","","","","","","","","","","","","","","0 : 0","","","","","","","","","","","","","","","","","","","","","","","","2 : 0","","","","","","","","","","","","","","","","0 : 0","","","","","","","","","","","","","","","","","","","1 : 0","","","","","","","","","","","","","","","","","","","","1 : 3","3 : 0","","","","","","","","3 : 1","1 : 3","","","","","","","","","","","","3 : 0","","","","","","","","","","","","","","","0 : 3","","","","","","2 : 2","","5 : 1","","",""]
[null,63,"TM 63",null,null,null,63,127,173,"TM 127","-","TM 173",0,":",1,null,63,"Eintracht Frankfurt",13,6,3,4,27,":",20,7,21,"","Eintracht Frankfurt","","","","","","","","","","","","","","","","","","","","","","","","","","","","","","","","","","","","","","","","","","","","","","","","","","","","","","","","","","","","","","","","","","","","","","","","","","","9 : 2","","","","","","","","","","","","","","","0 : 3","","","","","","","","","","","","","","","","","","","0 : 0","","","","0 : 0","","","","3 : 0","","","","","","","","","","","","","0 : 1","","","","0 : 3","","","","","","","","0 : 0","","","","","","","","","0 : 4","","","","","","","","","","","","","3 : 1","","","","","","","","4 : 3","","","","","","","","","","","","","","","3 : 1","","","","","","","","5 : 2","","","","","","","","","",""]
[null,64,"TM 64",null,null,null,64,102,64,"TM 102","-","TM 64",3,":",0,null,64,"TM 160",13,6,3,4,25,":",18,7,21,"","TM 160","","","","","","","","","","","","","","","","","","","","","","","","","","","","","","","","","","","","","","","","","","","","","","","","","","","","","","","","","","","","","","","","","","","","","","","","","","","","2 : 0","","","","","","","","","","0 : 3","","","","","","","","","","","","","","","","","","","","","","","","","","","","","","","","","","","","","","","","","","5 : 2","0 : 0","","","","","","","","","","","","","","","","","","","","2 : 0","0 : 3","","","","","","1 : 3","","","","","","","","","0 : 0","","","","0 : 0","5 : 1","","","","","","","","","","","","","","","","","","0 : 4","","","","9 : 2","","","","1 : 0","","","","","","","","",""]
[null,65,"TM 65",null,null,null,65,195,181,"TM 195","-","TM 181",1,":",5,null,65,"TM 197",12,6,3,3,22,":",15,7,21,"","TM 197","","","","","","","","","","","","","","","","","","","","","","","","","","","","","","","","","","","","","","","","","","","","","","","","","","","","","","","","","","","","","","","","","","","","","","","","","","","","","","","","","","","","","","","","","","","","","","","","","","","","","","","","","","","","","","","","5 : 2","","","","","","","","","","","","1 : 3","","","","","","","","0 : 0","","","","","","","","","","","","","","","","","","","","","3 : 0","","","","","","","","","","2 : 0","","","","","","","","","","","0 : 0","","","","5 : 1","","","","","3 : 1","","","","","","","","","","","","","","","","","","3 : 0","","0 : 0","",""]
[null,66,"TM 66",null,null,null,66,3,154,{"$f":"IFERROR(VLOOKUP($H71,$B$6:$C$205,2,0),\"\")","v":"FC Bayern München"},"-",{"$f":"IFERROR(VLOOKUP($I71,$B$6:$C$205,2,0),\"\")","v":"TM 154"},4,":",0,null,66,"TM 109",13,6,3,4,20,":",16,4,21,"","TM 109","","","","","","","","","","","","","","","","","","","","","","","","","","","","","","","","","","","","","","","","","","","","","","","","","","","","","","","","","","","","1 : 3","2 : 0","","","","","","","","","","","","","","","","","","","","","","","","","","","","","","","","","","","","","","","","","","","","","","","","","","","","","","","","","","","","","3 : 0","","","","","","0 : 3","","","0 : 0","","","","","","","","","","5 : 1","","","","4 : 0","0 : 0","","","2 : 5","1 : 0","","","","","","0 : 4","","","","","","","","","","","","","2 : 0","0 : 0","","","","","","","","","","","","","","","","","","","","","","","","","","","","","","","","","","",""]
[null,67,"TM 67",null,null,null,67,65,142,"TM 65","-","TM 142",2,":",5,null,67,"TM 118",13,6,3,4,20,":",17,3,21,"","TM 118","","","","","","","","","","","","","","","","","","","","","","","","","","","","","","","","","","","","","","","","","","","","","","","","","","","","","","","","","","","","","","","","","","0 : 0","","","","","","","","","","","","","","","","","","","","","","","","","","","","","","","","","","","","5 : 1","","","","","","","","","","","","","","","","1 : 0","","","","","","","","0 : 0","","","","","","","","","","","1 : 3","0 : 4","","","","","","","","","","","","","","5 : 2","","","","","0 : 3","","","3 : 0","","","","","","0 : 3","","","","","","","","","","","","","","","","","","","","","","","","","","","","2 : 0","","","","","","3 : 1","","0 : 0","","",""]
[null,68,"TM 68",null,null,null,68,103,67,"TM 103","-","TM 67",3,":",1,null,67,"TM 140",13,6,3,4,20,":",17,3,21,"","TM 140","","","","","","","","","","","","","","","","","","","","","","","","","","","","","","","","","","","","","","","","","","","","","","","","","","","","","","","","","","","","","","","","","","","","","","","","","","","","","","","","","","","","","","","","","","","","","","","","","","","","","","","","","","","","","5 : 2","","","","0 : 3","","","","0 : 4","","","","","","","","3 : 1","","","","","5 : 1","","","","","","","","","","","","","","","","","","","","","0 : 0","","","","","","","","","","0 : 0","","","2 : 0","","","","1 : 3","","","","","","","","","","","","","","","","","","","0 : 0","","","","","","","","3 : 0","","","","0 : 3","","","","","1 : 0",""]
[null,69,"TM 69",null,null,null,69,196,70,"TM 196","-","TM 70",0,":",3,null,69,"TM 183",13,6,3,4,16,":",19,-3,21,"","TM 183","","","","","","","","","","","","","","","","","","","","","","","","","","","","","","","","","","","","","","","","","","","","","","","","","","","","","","","","","","","","","","","","","","","","","","","","","","","","0 : 0","","","","","","","","","","2 : 2","","","","","","","","2 : 0","","","","","","","","","","","","","","","","","","","","","","0 : 4","","","","","","","","","","","","0 : 0","0 : 3","","","","","","","","","","","","","","","","","","","","","","","","","","","2 : 0","","","","","","","","","1 : 0","","","","1 : 0","0 : 4","","","","","","","","","","","","","","","","","","5 : 2","","","","3 : 1","","","","0 : 3","","","","","","","","",""]
[null,70,"TM 70",null,null,null,70,172,193,"TM 172","-","TM 193",1,":",2,null,70,"TM 117",13,6,3,4,20,":",24,-4,21,"","TM 117","","","","","","","","","","","","","","","","","","","","","","","","","","0 : 4","","","","","","","","","","","","","","","","","","","","","1 : 0","","0 : 0","","0 : 2","","","","","","","","","","","","","","","","","2 : 9","","","","","","","","","","","","","","","","","","","","","","5 : 2","","","","","","","","","","","","","","","","","","","","","","","","","","","","","","","","","","","","","","","","1 : 5","","","","3 : 1","","","","","","","","0 : 0","","","","","","","","","0 : 0","","","","","","","","","","","","","2 : 0","","","","","","","","3 : 1","","","","","","","","","","","","","","","","","","","","","","","","","","","","","","","","",""]
[null,71,"TM 71",null,null,null,71,90,155,"TM 90","-","TM 155",3,":",1,null,71,"Red Bull Salzburg",13,6,2,5,28,":",19,9,20,"","Red Bull Salzburg","","","","","","","5 : 1","","0 : 3","","","3 : 0","","","","","","","0 : 3","","9 : 2","","","","","","","0 : 0","","","","","","","","","","","","","1 : 5","","","","","","","","","","","","3 : 1","","4 : 0","","","","","","","","","","","3 : 1","","","0 : 2","","","","","0 : 0","","","","","","","","","","","","","","","","","","","","","","","","","","","","","","","","","","","","","","","","","","","","","","","","","","","","","","","","","","","","","","","","0 : 1","","","","","","","","","","","","","","","","","","","","","","","","","","","","","","","","","","","","","","","","","","","","","","","","","","","","","","","","","","","","","","","","","","",""]
[null,72,"TM 72",null,null,null,72,69,9,"TM 69","-","FC Barcelona",1,":",3,null,72,"TM 196",12,6,2,4,25,":",16,9,20,"","TM 196","","","","","","","","","","","","","","","","","","","","","","","","","","","","","","","","","","","","","","","","0 : 3","","","","","","","","","","","","","","","","","9 : 2","","","","","","","","","","","","","","","","","","","","","","","","","","","","","","","","","","","","0 : 0","","","","","","0 : 3","","","","","","","","","","","1 : 3","","","","","","","","","","","","","","","","","","","","","","","","","","3 : 0","","","","","","","0 : 1","","","","","0 : 0","","","","","","","","","","","","","","","","","","","","","","","3 : 1","","","","","","","","","","","","","","","","","","5 : 2","3 : 1","","","","","","","","","","","","","","","1 : 0"]
[null,73,"TM 73",null,null,null,73,149,28,"TM 149","-","AS Monaco",2,":",0,null,73,"TM 170",12,6,2,4,28,":",21,7,20,"","TM 170","","","","","","","","","","","","","","","","","","","","","","","","","","","","","","","","","","","","2 : 5","","","","","","","","","","","","1 : 3","","","","","","","","","","","","","","","","","","","0 : 0","","","","","","","","","","","","1 : 5","","","3 : 0","","","","","","","","","","3 : 1","","","","","3 : 1","","","","","","","","","","","","","","","","","","3 : 1","","","","","9 : 2","","","","","","","","","","","","","","","","","","","0 : 3","","","","","","","","","","","","","","","","","","","","","","","","","","","","","","","","","","","","","","3 : 0","","","","","","","","0 : 0","","","","","","","","","","","","","","","","","","","",""]
[null,74,"TM 74",null,null,null,74,170,26,"TM 170","-","Roter Stern Belgrad",0,":",0,null,74,"TM 151",12,6,2,4,26,":",20,6,20,"","TM 151","","","","","","","","","","","","","","","","","","","","","","","","","","","","","","","","","","","","","","","","","","","","","","","","","","0 : 3","","","","","","","","","","","","","","","","","","","","","","","","","","","","5 : 1","","","","","0 : 4","","","","","","","","","","","","","","","","","","","0 : 3","","5 : 2","","","","","","","","","","","","","","","","","","","","","","","","","","","","","","","","","0 : 0","","","","","","","","","","","","","","","","","","","","3 : 1","0 : 0","","","","","","","","","9 : 2","","","","","","","","","","","","3 : 1","","","","","","","","","","","","","","","1 : 0","","","","","","","","","","",""]
[null,75,"TM 75",null,null,null,75,143,152,"TM 143","-","TM 152",3,":",0,null,75,"TM 99",13,6,2,5,22,":",17,5,20,"","TM 99","","","","","","","","","9 : 2","","","","","","","","","","0 : 0","","3 : 1","","","","","","","0 : 1","","","","","","","","","","","","","","","","","","","","","","","","","","","0 : 3","","","","","","","","","","","1 : 3","","","","","","","","","","","","","","","","","","","","","","","","","","","","","","","","","","","","","","","","","","","","","","","","","","","","0 : 3","","","","","","","","3 : 1","","","","","","","","","","","","3 : 0","","","","","","","","","","","","","","0 : 0","","","","","","","","2 : 0","","","","","","0 : 3","","","","","","","","","","","","","","","","","","","","","","","","","","","","","","","","","","1 : 0","","","","",""]
[null,76,"TM 76",null,null,null,76,141,41,"TM 141","-","TM 41",0,":",0,null,76,"TM 198",12,6,2,4,22,":",18,4,20,"","TM 198","","","","","","","","","","","","","","","","","","","","","","","","","","","","","","","","","","","","","","","","","","","","","","","","","","","","","","","","","","","","","","","","","","","","","","","","","","","","","","","","","","","","","","","","","","","","","","","","","","","","","","","","","","","","","","","","","","","","","","","","","","","","","","","","","","","","0 : 3","","","1 : 3","","","","","","","","","","","","0 : 3","","","","","","","","","","","","","","","","3 : 0","","","","","","","","","","5 : 1","","","","2 : 1","","","0 : 0","","0 : 0","","","5 : 2","","","","","","","","","","","","3 : 1","","","","3 : 1","","","",""]
[null,77,"TM 77",null,null,null,77,128,167,"TM 128","-","TM 167",1,":",0,null,77,"TM 66",12,6,2,4,20,":",17,3,20,"","TM 66","","","","","","","","","","","","","","","","","","","","","","","","","","","","","","","","","","","","","","","","","","","","","","","","","","5 : 1","","","","","","","","","","","","","","","","","","","","","","","","","","","","0 : 3","","","","","0 : 2","","","","","","","","","","","","","","","","","","","0 : 0","","","","","","","","","","","","","","","","","","","","","","","","","","","","","","","","","","","0 : 4","","","","","","","","","","","","","","","","","","","","3 : 0","0 : 3","","","","","","","","0 : 0","1 : 0","","","","","","","","","","","","3 : 1","","","","","","","","","","","","","","","5 : 2","","","","","","","","3 : 1","","",""]
[null,78,"TM 78",null,null,null,78,61,119,"TM 61","-","TM 119",0,":",3,null,78,"TM 80",12,6,2,4,17,":",14,3,20,"","TM 80","","","","","","","","","","","","","","","","","","","","","","","","","","","","","","","","","","","","","","","","","","","","","","","","","","","","","","","","","","","","","","","","","","","","","","","","","","","","","","","4 : 0","","","2 : 0","","","","","","","","","","0 : 0","","","","","","","","","","","","","","","","","","","","","","","0 : 3","","","","","0 : 1","","","","","","","","","","","","","","","","","","","3 : 1","","","","","","","","0 : 4","","","","","","","","","","","","","","","","","","","","","","","","","","","","","","0 : 0","","","2 : 0","","1 : 0","","","2 : 5","","","","","","","","","","","","","","","","","","","",""]
[null,79,"TM 79",null,null,null,79,50,114,"TM 50","-","TM 114",5,":",1,null,79,"TM 149",12,6,2,4,23,":",21,2,20,"","TM 149","","","","","","","","","","","","","","","","","","","","","","","","","","","","","","","","","","","","","","","","","","","","","","","","","","","","","","","","","2 : 0","","","","","","","","","","","","","","","","","","","","","","","","","","","","","","","","","","","","1 : 5","","","","","","","","","","","","","","","","","3 : 0","","","","","","","","","","","","","","","","","","","","","","","","","","2 : 5","","","","","","","4 : 0","","","","","3 : 1","","","","","","","","","","","","","","","","","","","","","","","2 : 1","","","","","","","1 : 3","","","","","","","","","","","0 : 0","0 : 0","","","","","","","","","","","","","5 : 2","","0 : 4"]
[null,80,"TM 80",null,null,null,80,80,79,"TM 80","-","TM 79",0,":",4,null,80,"TM 131",12,6,2,4,21,":",19,2,20,"","TM 131","","","","","","","","","","","","","","","","","","","","","","","","","","","","","","","","","","","","","","","","","","","","","","","","","","","","","","","","","","","","","","","","","","","","","","","","","","","","","","","","","","","","","","","","","","","","","","","","","","","","","","","","","","","","","","","","","","","","","","","","","","","","0 : 4","","","","","","","","2 : 0","","","5 : 2","","","","","","","","","","","","0 : 3","","","","","","","","","","","","","","","","9 : 2","","","","","","","","","","","","","","0 : 4","","","0 : 0","","0 : 3","","","2 : 0","","","","","","","","","","","","0 : 0","","","","1 : 0","","","",""]
[null,81,"TM 81",null,null,null,81,96,135,"TM 96","-","TM 135",5,":",2,null,81,"TM 162",13,6,2,5,26,":",25,1,20,"","TM 162","","","","","","","","","1 : 3","","","","","","","","","","4 : 0","","3 : 1","","","","","","","2 : 5","","","","","","","","","","","","","3 : 0","","","","","","","","","","","","","","1 : 5","","","","","","","","","","","2 : 5","","","3 : 0","","","","","2 : 2","","","","","","","","","","","","","","","","","","","","","","","","","","","","","","","","","","","","","","","","","","","","","","","","","","","","1 : 3","","","","","","","","","","","","0 : 0","","","","","","","","","","","","","","","","","","","","","","3 : 1","","","","","","","","","","","","","","","","","","","","","","","","","","","","","","","","","","","","","","","","","","","","",""]
[null,82,"TM 82",null,null,null,82,37,22,"AC Roma","-","Celtic Glasgow",3,":",1,null,82,"TM 143",12,6,2,4,17,":",16,1,20,"","TM 143","","","","","","","","","","","","","","","","","","","","","","","","","","","","","","","","","","","","","","","","","","","","","","","","","","","","","","","","","","","","","","","","","","","","","","","","","","","","","","","","","","","","","","","","","","","","","3 : 0","","","","","","","","","","","","","","","","","3 : 1","","","","","","","","","","","","","","","","","","","","","","","","","","1 : 0","","","","","","","0 : 0","","","","","0 : 3","","","","","","0 : 3","","","","","","","","","","","","","","","","","2 : 0","","","","","","","3 : 1","","","","","","","","","","","1 : 3","2 : 5","","","","","","","","","","","","","0 : 0","","2 : 0"]
[null,83,"TM 83",null,null,null,83,139,169,"TM 139","-","TM 169",0,":",3,null,83,"Borussia Dortmund",13,6,2,5,23,":",25,-2,20,"","Borussia Dortmund","","","","","","","","","","3 : 0","","","","","","1 : 3","","","","","","1 : 3","","","","","0 : 0","","","","","","","","","","","","","","","","","","","","","","","","","","","","","","","","0 : 0","","","","3 : 1","2 : 5","","","","","","","","","","","","","","","","","","","","","","","","","","","","","","","","","","","","1 : 5","","","","","","","","","","","","","","0 : 6","","","","","3 : 1","","3 : 1","","3 : 0","","","","","","","","","","","","","","","","","","","","","","","","","","","","","","","","","","","","","","","","","","","","","","","","","","","","","","","","","","3 : 0","","","","","","","","","","","","","","","","","","","","","","","",""]
[null,84,"TM 84",null,null,null,84,82,200,"TM 82","-","TM 200",1,":",2,null,84,"FC Basel",13,6,2,5,19,":",21,-2,20,"","FC Basel","","","","","","","","","","","","","","","","","","","","","","","","","","","","","","","","","","","","","","","","","","","","","","","","","","","","","","","","","","","","","","","","","","","","","","","","","","","","","","","","","","","","","","","","","","","","","","","","","","","","","","","","","","","","","1 : 0","","","","","","","","0 : 0","","","","","","","","0 : 3","","","","","3 : 0","","","","","","","","","","0 : 4","","","","","","","","","","","5 : 2","","","","","","","","","","0 : 3","","","0 : 4","","","","5 : 1","","","","","","","","","","","","","","","","","","","0 : 3","","","","","","","","3 : 1","","","","0 : 0","","","","","2 : 0",""]
[null,85,"TM 85",null,null,null,85,124,101,"TM 124","-","TM 101",2,":",1,null,85,"Dinamo Zagreb",13,6,2,5,18,":",20,-2,20,"","Dinamo Zagreb","","","","","","","","","","","","","","","","","","","","","","","","","","","","","","","","","","","","","","","","","","","","","","","0 : 0","","","","3 : 1","","","","","","","","","","","","","","","","","3 : 0","","","","","","","2 : 5","","","","","","","","","","","","","","","","","","","","","","","","","","","","","","","","","","","","","","0 : 2","","","","1 : 3","","","","","","","","","","","","","3 : 1","","","","3 : 1","","","","","","","","2 : 0","","","","","","","","","1 : 0","","","","","","","","","","","","","0 : 0","","","","","","","","0 : 4","","","","","","","","","","","","","","","","","","","","","","","0 : 3","","","","","","","","","",""]
[null,86,"TM 86",null,null,null,86,123,1,"TM 123","-","Real Madrid",1,":",3,null,86,"TM 90",12,6,1,5,28,":",19,9,19,"","TM 90","","","","","","","","","","","","","","","","","","","","","","","","","","","","","","","","","","","","","","","","","","","","","","","","","","","","","","","","","0 : 1","","","","","","","","","","","","","","","","","","","","","","","","","","","","","","","","","","","","1 : 3","","","","","","3 : 1","","","","","","","","","","","1 : 5","","","","","","","","","","","","","","","","","","","","","","","","","","0 : 0","","","","","","","2 : 0","","","","","0 : 3","","","","","","","","","","","","","","","","","","","","","","","0 : 3","","","","","","","5 : 1","","","","","","","","","","","4 : 0","3 : 0","","","","","","","","","","","","","","","9 : 2"]
[null,87,"TM 87",null,null,null,87,58,179,"TM 58","-","TM 179",2,":",0,null,87,"TM 64",12,6,1,5,29,":",21,8,19,"","TM 64","","","","","","","","","","","","","","","","","","","","","","","","","","","","","","","","","","","","","","","","","","","","","","","","","","1 : 3","","","","","","","","","","","","","","","","","","","","","","","","","","","","1 : 3","","","","","0 : 0","","","","","","","","","","","","","","","3 : 1","","","","5 : 1","","0 : 1","","","","","","","","","","","","","","","","","","","","","","","","","","","","","","","","","","","","","","","","","","","","","","","","","","","","","0 : 3","2 : 0","","","","","","","","","0 : 4","","","","","","","","","","","","5 : 2","","","","","","","","","","","","","","","9 : 2","","","","","","","","3 : 1","","",""]
[null,88,"TM 88",null,null,null,88,56,112,"TM 56","-","TM 112",0,":",0,null,88,"TM 152",12,6,1,5,28,":",20,8,19,"","TM 152","","","","","","","","","","","","","","","","","","","","","","","","","","","","","","","","","","","","","","","","","","","","","","","","","","","","","","","","","","","","","","","","","","","","","","","","","","","","","0 : 0","","","","","","","5 : 1","","","0 : 3","","","","3 : 1","","","","","","","","","","0 : 4","","","","","","","","","","","","","","","","","","","","","","","","","","2 : 0","","","","","","3 : 0","","","","","","","","","","","3 : 0","","","","","","","","","","","","","","","9 : 2","","","","","","","","","","","","","","","","","","","","","","","","","","","","","","","","1 : 3","","1 : 3","","","","","","","","","","","",""]
[null,89,"TM 89",null,null,null,89,13,121,"Juventus Turin","-","TM 121",3,":",0,null,89,"TM 84",13,5,4,4,23,":",18,5,19,"","TM 84","","","","","","","","","0 : 0","","","","","","","","","","0 : 3","","0 : 3","","","","","","","9 : 2","","","","","","","","","","","","","","","","","","","","","","","","","","","3 : 1","","","","","","","","","","","0 : 0","","","","","","","","0 : 2","","","","","","","","","","","","","","","","","","","","","","","","","","","","","","","","","","","","","","","","","","","","0 : 0","","","","","","","","3 : 0","","","","","","","","","","","","3 : 1","","","","","","","","","","","","","","0 : 4","","","","","","","","0 : 0","","","","","","","","","","","","","","","","","","","","","","","","","","","","","","","","","","","","","","","","5 : 2","","","","",""]
[null,90,"TM 90",null,null,null,90,105,111,"TM 105","-","TM 111",0,":",0,null,90,"TM 163",13,6,1,6,29,":",25,4,19,"","TM 163","","","","","","","","","0 : 1","","","","","","","","","","1 : 3","","2 : 5","","","","","","","2 : 0","","","","","","","","","","","","","","","","","","","","","","","","","","","","","","","","","","","","","","1 : 5","","","","","","","","","","","","","","","","","","","","","","","","","","","","","","","","","","","","","","","","","","","","","","","","","","","","5 : 1","","","","","","","","0 : 3","","","","","","","","","","","0 : 4","0 : 0","","","","","","","","","","","","","","3 : 0","","","","","","","","4 : 0","","","","","","2 : 1","","","","","","","","","","","","","","","","","","","","","","","","","","","","","","","","","","9 : 2","","","","",""]
[null,91,"TM 91",null,null,null,91,52,136,"TM 52","-","TM 136",1,":",0,null,91,"TM 124",12,6,1,5,27,":",23,4,19,"","TM 124","","","","","","","","","","","","","","","","","","","","","","","","","","","","","","","","","","","","","","","","","","","","","","","","","","","","","","","","","","","","","","","","","","","","","","","","","","","","","","","","","","","","","","","","","","","","","","","","","","","","","","","","","","","","","","","","0 : 3","","","","","","","","","","","","5 : 1","","","","","","","","","","","","","","","","","","","","","","","","0 : 4","","","","","0 : 3","0 : 0","","","","","","","","","","","","","","","","","1 : 3","","","0 : 3","","","","2 : 0","","","","","9 : 2","","","","","","2 : 1","","","","","","","","","","","","","","3 : 1","","5 : 2"]
[null,92,"TM 92",null,null,null,92,198,53,"TM 198","-","TM 53",0,":",3,null,92,"TM 193",12,6,1,5,19,":",15,4,19,"","TM 193","","","","","","","","","","","0 : 1","","","","","","","","","","","","","","","","","","","","","","","","","","","","","","","","","","","","","","","0 : 2","","","","","","","","","","","","","","","","","","","","","","","","","","","","1 : 3","","","","","","","","","","","","","","","","","","","","1 : 3","","","","","","5 : 1","","","3 : 0","","","","","","","","","","","","","","","","","","","","","","","","","","","","","","","","","","","","","","","","","","","","","","","","","","","3 : 1","","","","","","","","","0 : 0","","","","","","","","","","","","1 : 0","","","","","","","","","","","","","","","","","","","","","","","2 : 1","","",""]
[null,93,"TM 93",null,null,null,93,197,15,"TM 197","-","FC Arsenal",5,":",1,null,93,"TM 123",12,6,1,5,23,":",21,2,19,"","TM 123","","","","","","","","","","","","","","","","","","","","","","","","","","","","","","","","","","","","","","","","","","","","","","","","","","","","","","","","","","","","","","","","","","","","","","","","","","","","","","","","","","","","","","","","","","","","1 : 3","","","","","3 : 1","","","","","","","","","","","","","","","","","","5 : 1","","","","","","","","","","","","","","","","","","","","5 : 1","","","","3 : 0","","","","","","","","0 : 0","","","","","","","","","","","","","","","","","","","","","","","","","","0 : 3","","","","2 : 5","","","0 : 4","","2 : 0","","","1 : 0","","","","","","","","","","","","1 : 3","","","","","","","",""]
[null,94,"TM 94",null,null,null,94,131,130,"TM 131","-","TM 130",0,":",4,null,94,"TM 155",13,6,1,6,25,":",24,1,19,"","TM 155","","","","","","","","","","","","","","","","","","","","","","","","","","","","","","","","","","","","","","","","","","","","","","","","","","","","","","","","","","","","","","","","","","","","","","","","","","","","","3 : 0","","","","","","","","","","","","","","1 : 3","","","","","","","","","","5 : 1","","","","","","","","","","","","","","","","","","","","","","","","","","1 : 3","","","","","","1 : 3","","","","","","","","","","","0 : 4","","","","","","","","","","","","","","","0 : 3","","","","","","","","","","","","","","","","0 : 3","3 : 1","","","","","","","","0 : 0","","","","","","","3 : 1","","5 : 2","","","","","3 : 0","","","","","","",""]
[null,95,"TM 95",null,null,null,95,189,60,"TM 189","-","TM 60",5,":",2,null,95,"TM 129",13,6,1,6,27,":",27,0,19,"","TM 129","","","","","","","","","","","","","0 : 4","","1 : 3","","","","","","","","","","","","","","0 : 3","","0 : 0","","","","","","","","","","","0 : 4","","5 : 2","","","","","","","","","","","","","","","","","","","","","","","","","","","","","","","","","","","","","","","","","","","","5 : 1","","","","","","","","","","","","","","","","","","","","","","","3 : 1","","","","","","","","","","","","","","3 : 1","","","","","","","","","","","","","","","9 : 2","","","","","","","","","","","","","","","","","","","","","","","","","","","","0 : 3","","","","","","","","","","","","","","","","","","","","","","","","","","","","","","","0 : 3","","","","","1 : 0",""]
[null,96,"TM 96",null,null,null,96,62,92,"TM 62","-","TM 92",3,":",1,null,96,"TM 127",12,6,1,5,25,":",25,0,19,"","TM 127","","","","","","0 : 1","","","","","","","","3 : 0","","","","","","","","","","","","","","","","","","","","","","","","","","2 : 9","","","","","","","","","","","","","","","","","1 : 3","","","","","","","","3 : 0","","","","","","","","","","","","","","","","","","","","","","","","","","","","4 : 0","","","","","","1 : 5","","","","","","","","","","","2 : 5","","","","","","","","","","","","","","","","","","","","","","","","","","0 : 0","","","","","","","3 : 0","","","","","","","","","","","","","","","","","","","","","","","","","","","","","","","","","","","","","","","","","","","","","","3 : 1","3 : 1","","","","","","","","","","","","","","",""]
[null,97,"TM 97",null,null,null,97,59,55,"TM 59","-","TM 55",0,":",3,null,97,"TM 103",13,6,1,6,22,":",22,0,19,"","TM 103","","","","","","","","","","","","","","","","","","","","","","","","","0 : 3","","","","","","","","","","3 : 1","0 : 1","","","","","","","","","","","","3 : 0","","","","","","1 : 3","","","","","","","","","","","","","0 : 2","","","","","1 : 5","","","","","","","3 : 0","","","0 : 0","","","","","","","","","","1 : 5","","","","","","","","","","","","","","","","","","","","","","","3 : 1","","","","","4 : 0","","","","","","","","","","","","","","","","","","","3 : 1","","","","","","","","","","","","","","","","","","","","","","","","","","","","","","","","","","","","","","","","","","","","","","","","","","","","","","","","","","","","","","","","","",""]
[null,98,"TM 98",null,null,null,98,122,125,"TM 122","-","TM 125",0,":",2,null,98,"TM 52",12,6,1,5,21,":",23,-2,19,"","TM 52","","","","","","","","","","","","","","","","","","","","","","","","","","","","","","","","","","","","","","","","","","","","","","","","","","","","","","","","","","","","","","","","","","","","","","","","","","","","","","","","","","","","","","","","","","","","","","","","","","","","","","","","","","","","","","","","0 : 0","","","","","","","","","","","","3 : 0","","","","","","","","2 : 9","","","","","","","","","","","","","","","","","","","","","5 : 1","2 : 0","","","","","","","","","1 : 3","","","","","","","","","","","0 : 4","","","","1 : 3","","","","","3 : 0","","","","","","","","","","","","","","","","","","3 : 0","","0 : 3","","1 : 0"]
[null,99,"TM 99",null,null,null,99,76,100,"TM 76","-","TM 100",3,":",1,null,99,"TM 82",12,6,1,5,19,":",22,-3,19,"","TM 82","","","","","","","","","","","","","","","","","","","","","","","","","","","","","","","","","","","","","","","","","","","","","","","","","","","","","","","","","","","","","","","","","","","","","","","","","","","","","","","2 : 5","","","","","","","","","","","","","1 : 0","","","","","1 : 5","","","","","","","","","","","","","","","","","","2 : 0","","","","","","","","","","","","","","","","","","","","1 : 2","","","","0 : 4","","","","","","","","5 : 2","","","","","","","","","","","","","","","","","","","","","","","","","","1 : 0","","","","3 : 0","","","0 : 0","","0 : 3","","","3 : 1","","","","","","","","","","","","","","","","","","","",""]
[null,100,"TM 100",null,null,null,100,164,54,"TM 164","-","TM 54",1,":",3,null,100,"TM 189",12,6,1,5,20,":",27,-7,19,"","TM 189","","","","","","","","","","","","","","","","","","","","","","","","","","","","","","","","","","","","","","","","","","","","","","","","","","","","","","","","","","","","","","","","","","","","","","","","","","","","","","","","","","","","","","","","","","","","","","","","","","","","","","","","","","","","","","","","1 : 0","","","","","","","","","","","","0 : 3","","","","","","","","","","","0 : 3","","","","","","","","","","","","","","","","","","3 : 1","1 : 0","","","","","","","","","5 : 2","","","","","","","","","","","0 : 3","","","","","","","","","0 : 3","","","","","","","","","","","","","","3 : 1","","","","0 : 0","","5 : 2","",""]
[null,101,"TM 101",null,null,null,101,33,137,"Sturm Graz","-","TM 137",2,":",0,null,101,"TM 188",13,5,3,5,27,":",18,9,18,"","TM 188","","","","","","","","","","","","","","","","","","","","","","","","","","","","","","","","","","","","","","","","","","","","","","","","","","","","","","","","","","","","0 : 0","1 : 3","","","","","","","","","","","","","","","","","","","","","","","","","","","","","","","","","","","","","","","","","","","","","","","1 : 3","","","","","","","","","","","","","","0 : 1","","","","","","","","","2 : 0","","","","","","","","","","9 : 2","","","","1 : 5","3 : 0","","","4 : 0","0 : 0","","","","","","5 : 1","","","","","","","","","","","","","1 : 3","","","0 : 0","","","","","","","","","","","","","","","","","","","","","","","","","","","","","","","","",""]
[null,102,"TM 102",null,null,null,102,32,35,"VfB Stuttgart","-","Eintracht Frankfurt",0,":",0,null,102,"TM 105",12,5,3,4,23,":",18,5,18,"","TM 105","","","","","","","","","","","","","","","","","","","","","","","","","","","","","","","","","","","","","","","","","","","","","","","","","","","","","","","","","","","","","","","","","","","","","","","","","","","","","","","","","","","","","","","","","","","","","","","","","0 : 3","","","","","","","","","","","","","","","","","","","","","","","","","","","","","","","","","","","","","","0 : 4","","","","0 : 0","","","","","","","","1 : 0","","","","","","","","","","","","","","","","0 : 3","","","","","","","","","","9 : 2","","","","5 : 1","","","5 : 2","","0 : 0","","","1 : 3","","","","","","","","","","","","2 : 0","","","","0 : 0","","","",""]
[null,103,"TM 103",null,null,null,103,161,31,"TM 161","-","FC Girona",3,":",0,null,103,"TM 115",13,5,3,5,22,":",22,0,18,"","TM 115","","","","","","","","","","","","","","","","","","","","","","","","","","","","","","","","","","","","","","","","","","","","","","","","","","","","","","","","","","","","1 : 2","3 : 0","","","","","","","","","","","","","","","","","","","","","","","","","","","","","","","","","","","","","","","","","","","","","3 : 1","","","","","","","","","","","","","","","","1 : 3","","","","","","","","","1 : 5","","","","","","","","","","0 : 0","","","","0 : 0","2 : 5","","","3 : 0","3 : 1","","","","","","0 : 0","","","","","","","","","","","","","0 : 3","5 : 2","","","","","","","","","","","","","","","","","","","","","","","","","","","","","","","","","","",""]
[null,104,"TM 104",null,null,null,104,23,138,"Dinamo Zagreb","-","TM 138",0,":",0,null,104,"TM 97",13,5,3,5,22,":",23,-1,18,"","TM 97","","","","","","","","","","4 : 0","","","","","","0 : 2","","","","","","2 : 9","","","","3 : 1","","","","","","","","","","","","","","","","","","","","","3 : 0","","0 : 0","","1 : 5","","","","","","","","0 : 0","","","","","3 : 0","","","","0 : 0","","","","","2 : 5","","","","","","","","","","","","","","","","0 : 1","","","","","","","","","","","","","","","","","","","","","","","","","","","","","","","","","","","","","","","","","","","","","","","","","","","","","4 : 0","","","","","","","","","","","","","","","","","","","","","","","","","","","","","","","","","","","","","","","","","","","","","","","","","","","","","","","","","","","","","","",""]
[null,105,"TM 105",null,null,null,105,146,21,"TM 146","-","PSV Eindhoven",1,":",0,null,105,"TM 135",12,5,2,5,23,":",19,4,17,"","TM 135","","","","","","","","","","","","","","","","","","","","","","","","","","","","","","2 : 5","","3 : 0","","","","","","","","","","","","","","","","","","","","","","","","","","4 : 0","","","","","","","","","","","","","","","","","","","3 : 1","","","","","","","0 : 3","","","1 : 3","","","","5 : 1","","","","","","","","","","5 : 2","","","","","","","","","","","","","","","","","","","","","","","","","","0 : 1","","","","","","0 : 0","","","","","","","","","","","","","","","","","","","","","","","","","","0 : 0","","","","","","","","","","","","","","","","","","","","","","","","","0 : 3","","","","","","","","","","","","","","","","","","","","",""]
[null,106,"TM 106",null,null,null,106,18,47,"AC Mailand","-","TM 47",0,":",3,null,106,"TM 176",13,5,2,6,27,":",25,2,17,"","TM 176","","","","","","","","","","","","","","","","4 : 0","","","","","","","","","","","0 : 0","","","","","","","","","","","","","","","","","","","","","","","","","","","","","","","","0 : 3","","","","2 : 5","0 : 2","","","","","","","","","","","","","","","","","","","","","","","","","","","","","","","","","","","","1 : 3","","","","","","","","","","","","","","9 : 2","","","","","0 : 0","","0 : 1","","3 : 0","","","","","","","","","","","","","","","","","","","","","","","","","","","","","","","","4 : 0","","","","","","","","","","","","","","","","","","","","","","","","","","2 : 0","","","","","","","","","","","","","","","","","","","","","","","",""]
[null,107,"TM 107",null,null,null,107,153,17,"TM 153","-","Schachtjor Donezk",5,":",1,null,107,"TM 54",12,5,2,5,22,":",21,1,17,"","TM 54","","","","","","","","","","","","","","","","","","4 : 0","","","","","","","","","","","","4 : 0","","","3 : 0","1 : 3","","","","","","","","","","","2 : 9","3 : 1","","","","","","0 : 0","","","","","","0 : 2","","","","","","","","","","","","2 : 5","","","","","","","","","","","","","","","","","","","","","","","","","","3 : 0","","","","","","","0 : 0","","0 : 1","","","","","","","","","","","","","","","","","","","","","","","","","","","","","","","","","","","","","","","","","","","","","","","","","","","","","","","","","","","","","","","","","","","","","","","","","","","","","","","","","","","","","","","","","","","","","","","","","","","",""]
[null,108,"TM 108",null,null,null,108,117,42,"TM 117","-","TM 42",0,":",4,null,108,"TM 190",13,5,2,6,19,":",18,1,17,"","TM 190","","","","","","","","","","","","","","","","","","","","","","","","","","0 : 3","","","","","","","","","","","","","","","","","","","","","3 : 1","","1 : 3","","5 : 1","","","","","","","","","","","","","","","","","0 : 0","","","","","3 : 0","","","","","","","","","","","","","","","","","2 : 0","","","","","","","","","","","","","","","","","","","","","","","","","","","","","","","","","","","","","","","","1 : 3","","","","0 : 0","","","","","","","","3 : 0","","","","","","","","","","","","","","","","","","","","","","0 : 1","","","","","","","","1 : 3","","","","","","","","","","","","","","","","","","","","","","","","","","","","","","","","",""]
[null,109,"TM 109",null,null,null,109,43,191,"TM 43","-","TM 191",5,":",2,null,109,"TM 194",13,5,2,6,25,":",25,0,17,"","TM 194","","","","","","","","0 : 1","","","","","1 : 3","","2 : 5","","","","","","","","","1 : 3","","","","","1 : 0","","0 : 3","","","","","","","","0 : 0","","","0 : 0","","3 : 1","","","","","","","","","","","","","","","","","","","","","","","","","","","","","","","","","","","","","","","","","","","","6 : 0","","","","","","","","","","","","","","","","","","","","","","","2 : 9","","","","","","","","","","","","","","","","","","","","","","","","","","","","","3 : 0","","","","","","","","","","","","","","","","","","","","","","","","","","","","","","","","","","","","","","","","","","","","","","","","","","","","","","","","","","","6 : 0","","","","","",""]
[null,110,"TM 110",null,null,null,110,190,177,"TM 190","-","TM 177",1,":",3,null,110,"TM 154",12,5,2,5,19,":",19,0,17,"","TM 154","","","","","","","","","","","0 : 0","","","","","","","","","","","","","","","","","","","","","","","","","","","","","","","","","","","","","","","3 : 0","","","","","","","","","","","","","","","","","","","","","","","","","","","","1 : 3","","","","","3 : 0","","","","","","","","","","","","","","","1 : 5","","","","1 : 3","","0 : 2","","","","","","","","","","","","","","","","","","","","","","","","","","","","","","","","","","","","","","","","","","","","","","","","","","","","","","3 : 0","","","","","","","","","2 : 0","","","","","","","","","","","","0 : 0","","","","","","","","","","","","","","","0 : 4","","","","","","","","5 : 2","","",""]
[null,111,"TM 111",null,null,null,111,150,188,"TM 150","-","TM 188",3,":",1,null,111,"Mainz 05",13,5,2,6,21,":",22,-1,17,"","Mainz 05","","","","","","","","","2 : 5","","","","","","","","","","0 : 2","","3 : 1","","","","","","","0 : 0","","","","","","","","","","","","","1 : 3","","","","","","","","","","","","","","3 : 1","","","","","","","","","","","0 : 3","","","","","","","","4 : 0","","","","","","","","","","","","","","","","","","","","","","","","","","","","","","","","","","","","","","","","","","","","","","","","","","","","5 : 1","","","","","","","","","","","","1 : 3","","","","","","","","","","","","","","2 : 0","","","","","","","","0 : 3","","","","","","","","","","","","","","","","","","","","","","","","","","","","","","","","","","","","","","","","0 : 0","","","","",""]
[null,112,"TM 112",null,null,null,112,116,140,"TM 116","-","TM 140",0,":",2,null,112,"TM 187",13,5,2,6,21,":",23,-2,17,"","TM 187","","","","","","","","","","1 : 5","","","","","","3 : 1","","","","","","3 : 0","","","","0 : 1","","","","","","","","","","","","","","","","","","","","","1 : 3","","0 : 2","","5 : 2","","","","","","","","","","","","","","","","","0 : 3","","","","","4 : 0","","","","","","","","","","","","","","","","0 : 0","3 : 1","","","","","","","","","","","","","","","","","","","","","","","","","","","","","","","","","","","","","","","","","","","","0 : 0","","","","","","","","1 : 5","","","","","","","","","","","","","","","","","","","","","","","","","","","","","","","","","","","","","","","","","","","","","","","","","","","","","","","","","","","","","","",""]
[null,113,"TM 113",null,null,null,113,126,115,"TM 126","-","TM 115",0,":",0,null,113,"Paris Saint-Germain",13,5,2,6,22,":",27,-5,17,"","Paris Saint-Germain","","","","","","","","","","","","","","","","","","","","","","","","","2 : 9","","","","","","","","","","2 : 5","3 : 0","","1 : 3","","","","","","","","","","0 : 2","","","","","","4 : 0","","","","","","","","3 : 1","","","","","0 : 0","","","","","0 : 1","","","","","","","","3 : 0","","","","","","","","","","","","","","0 : 0","1 : 5","","","","","","","","","","","","","","","","","","","","","","","","","3 : 1","","","","","","","","","","","","","","","","","","","","","","","","","","","","","","","","","","","","","","","","","","","","","","","","","","","","","","","","","","","","","","","","","","","","","","","","","","","","","","","","","","","","",""]
[null,114,"TM 114",null,null,null,114,20,38,"Sporting Lissabon","-","FC Basel",0,":",3,null,113,"TM 182",13,5,2,6,22,":",27,-5,17,"","TM 182","","","","","","","","","","","","","3 : 0","","","","","","","","","","","0 : 3","","","","","2 : 9","","1 : 5","","","","","","","","4 : 0","","","3 : 0","","0 : 2","","","","","","","","","","","","","","","","","","","","","","","","","","","","","","","","","","","","","","","","","","","","1 : 3","","","","","","","","","","","","","","","","","","","","","","","0 : 0","","","","","","","","","","","","","","","","","","","","","","","","","","","","","2 : 0","","","","","","","","","","","","","","","","","","","","","","","","","","","","1 : 3","","","","","","","","","","","","","","","","","","","","","","","","","","","","","","","5 : 2","","","","","",""]
[null,115,"TM 115",null,null,null,115,78,109,"TM 78","-","TM 109",0,":",0,null,115,"FC Liverpool",12,5,2,5,20,":",25,-5,17,"","FC Liverpool","","","","","","","","","","","","","","","","","","","","","","","","","","","","","","","","","","","","","","","","","","","","","","","","","","","","","","","","","","","","","","","","","","","","","","","","","","","","","","2 : 9","","","","","1 : 0","","","","","","","","","","","","","","","","","","","0 : 4","","","","","","","","","","","","","","","","1 : 3","","","","","","","","","","","","","","","","","","","2 : 0","","","","","","","","","","","","","","","","","","","","5 : 1","1 : 3","","","","","","","","0 : 3","5 : 2","","","","","","","","","","","","0 : 0","","","","","","","","","","","","","","","0 : 0","","","","","","","","3 : 0","","",""]
[null,116,"TM 116",null,null,null,116,107,71,"TM 107","-","TM 71",0,":",1,null,116,"FC Brügge",13,5,2,6,19,":",25,-6,17,"","FC Brügge","","","","","","","","2 : 9","","","","","0 : 3","","0 : 1","","1 : 5","","","","","","","3 : 0","","","","","0 : 2","","0 : 0","","","","","","","","3 : 0","","","3 : 1","","5 : 1","","","","","","","","","","","","","","","","","","","","","","","","","","","","","","","","","","","","","","","","","","","","1 : 3","","","","","","","","","","","","","","","","","","","","","","","1 : 0","","","","","","","","","","","","","","","","","","","","","","","","","","","","","0 : 0","","","","","","","","","","","","","","","","","","","","","","","","","","","","","","","","","","","","","","","","","","","","","","","","","","","","","","","","","","","","","","","","",""]
[null,117,"TM 117",null,null,null,117,45,12,"TM 45","-","Atalanta Bergamo",3,":",0,null,116,"TM 161",13,5,2,6,19,":",25,-6,17,"","TM 161","","","","","","","0 : 1","","","","","","","","","","","","","","","","1 : 3","","","","","","","","","","","","","","2 : 5","","","","","","0 : 0","","","","","","","","","","3 : 0","","","","","","","3 : 0","1 : 3","","","","","","","","","","0 : 3","","","","","","","","","","","","","","","","","","","","","","","","","","","","","","","","","","","1 : 0","","3 : 1","","","","","","","","","","","","","","","","","","","","","","","","","","","","","","","","","3 : 0","","","","0 : 0","2 : 9","","","","","","","","","","","","","","","","","","","","","","","","","","","","","","","","","","","","","","","","","","","","","","","","","","","","","","","","","","",""]
[null,118,"TM 118",null,null,null,118,187,199,"TM 187","-","TM 199",1,":",5,null,118,"TM 192",13,5,2,6,17,":",23,-6,17,"","TM 192","","","","","","","","","","","","","0 : 2","","","","","","","","","","","","","","","","5 : 1","","0 : 4","","","","","","","","","","","0 : 3","","0 : 0","","","","","","","","","","","","","","","","","","","","","","","","","","","","","","","","","","","","","","","","","","","","0 : 3","","","","","","","","","","","","","","","","","","","","","","","0 : 3","","","","","","","","","","","","","","3 : 0","","","","","","","","","","","","","","","1 : 0","","","","","","","","","","","","","","","","","","","","","0 : 4","","","","","","","0 : 0","","","","","","","","","","","","","","","","","","","","","","","","","","","","","","","3 : 1","","","","","5 : 2",""]
[null,119,"TM 119",null,null,null,119,95,186,"TM 95","-","TM 186",4,":",0,null,119,"TM 130",12,5,1,6,20,":",23,-3,16,"","TM 130","","","","","","","","","","","","","","","","","","1 : 3","","2 : 5","","","","","","","","","","","","","3 : 1","3 : 1","","","","","","","","","","","0 : 1","0 : 0","","","","","","","","","","0 : 3","","","","","","","","","","","","","","3 : 1","","","","","","","","","","","","","","","4 : 0","","","","","","","","","","","1 : 5","","","","","","","0 : 3","","3 : 0","","","","","","","","","","","","","","","","","","","","","","","","","","","","","","","","","","","","","","","","","","","","","","","","","","","","","","","","","","","","","","","","","","","","","","","","","","","","","","","","","","","","","","","","","","","","","","","","","","","",""]
[null,120,"TM 120",null,null,null,120,98,166,"TM 98","-","TM 166",2,":",5,null,120,"FC Bologna",13,5,1,7,20,":",24,-4,16,"","FC Bologna","","","","","","","","","","0 : 2","","","","","","3 : 0","","","","","","4 : 0","","","","1 : 3","1 : 5","","","","","","","","","","","","","","","","","","","","","","0 : 3","","3 : 1","","","","","","","","3 : 1","","","","","0 : 0","","","","","","","","","1 : 3","","","","","","","","","","","","","","","","3 : 0","","","","","","","","","","","1 : 3","","","","","","","","","","","","","","","","","","","","","","","0 : 3","","","","","","","","","","","","","","","","","","","","","","","","","","","","","","","","","","","","","","","","","","","","","","","","","","","","","","","","","","","","","","","","","","","","","","","","","","","","","","","","","",""]
[null,121,"TM 121",null,null,null,121,165,185,"TM 165","-","TM 185",1,":",3,null,120,"TM 145",13,5,1,7,20,":",24,-4,16,"","TM 145","","","","","","","","","","","","","","","","","","","","","","","","","3 : 0","","","","","","","","","","4 : 0","1 : 3","","0 : 2","","","","","","","","","","3 : 1","","","","","","1 : 5","","","","","","","","0 : 1","","","","","","","","","","0 : 0","","","","","","","","1 : 3","","","","","","3 : 1","","","","","","","","0 : 3","3 : 0","","","","","","","","","","","","","","","","","","","","","1 : 5","","","","","","","","","","","","","","","","","","","","","","","","","","","","","","","","","","","","","","","","","","","","","","","","","","","","","","","","","","","","","","","","","","","","","","","","","","","","","","","","","","","","","","","","",""]
[null,122,"TM 122",null,null,null,122,97,73,"TM 97","-","TM 73",3,":",0,null,122,"TM 195",12,5,1,6,18,":",23,-5,16,"","TM 195","","","","","","","","","","","","","","1 : 3","","","","","","","","","","","","","","","","","","","","","","","","","","4 : 0","","","","","","","","","","","","","","","","","2 : 5","","","","","","","","1 : 5","","","","","","","","","","","","","","","","","","","","","","","","","","","","0 : 2","","","","","","3 : 1","","","","","","","","","","","1 : 0","","","","","","","","","","","","","","","","","","","","","","","","","","1 : 3","","","","","","","0 : 0","","","","","2 : 0","","","","","","","","","","","","","","","","","","","","","","","","","","","","","","","","","","","","","","","","","0 : 3","3 : 1","","","","","","","","","","","","","","",""]
[null,123,"TM 123",null,null,null,123,27,120,"Young Boys Bern","-","TM 120",2,":",9,null,123,"TM 45",13,5,1,7,25,":",31,-6,16,"","TM 45","","","","","","","1 : 2","","0 : 1","","","3 : 1","","","","","","","3 : 0","","","","1 : 5","","","","","","","","","","","","","","3 : 0","","","","2 : 5","","2 : 9","","","","","","","","","","4 : 0","","1 : 3","","","","","","","","","","","","","","2 : 5","","3 : 0","","","0 : 0","","","","","","","","","","","","","","","","","","","","","","","","","","","","","","","","","","","","","","","","","","","","","","","","","","","","","","","","","","","","","","","","","","","","","","","","","","","","","","","","","","","","","","","","","","","","","","","","","","","","","","","","","","","","","","","","","","","","","","","","","","","","","","","","","","",""]
[null,124,"TM 124",null,null,null,124,11,168,"Atletico Madrid","-","TM 168",1,":",3,null,124,"TM 95",13,5,1,7,24,":",30,-6,16,"","TM 95","","","","","","","2 : 5","","2 : 9","","","1 : 3","","","","","","","1 : 5","","1 : 3","","3 : 1","","","","","","","","","","","","","","1 : 2","","","","3 : 0","","4 : 0","","","","","","","","","","0 : 2","","3 : 0","","","","","","","","","","","","","","0 : 0","","","","","3 : 0","","","","","","","","","","","","","","","","","","","","","","","","","","","","","","","","","","","","","","","","","","","","","","","","","","","","","","","","","","","","","","","","","","","","","","","","","","","","","","","","","","","","","","","","","","","","","","","","","","","","","","","","","","","","","","","","","","","","","","","","","","","","","","","","","","",""]
[null,125,"TM 125",null,null,null,125,24,184,"Red Bull Salzburg","-","TM 184",3,":",1,null,125,"Sporting Lissabon",13,5,1,7,18,":",26,-8,16,"","Sporting Lissabon","","","","","","","","","","","","","","","","","","","","","","1 : 3","","","","0 : 0","","","","","","","","","","","","","","","","","","","","","0 : 2","","3 : 1","","0 : 4","","","","","","","","","","","","","","","","","1 : 0","","","","","1 : 5","","5 : 1","","","","","","","","","","","","","","0 : 3","1 : 3","","","","","","","","","","","","","","","","","","","","","","","3 : 1","","","","","","","","","","","","","","","","","","","","","0 : 3","","","","","","","","3 : 0","","","","","","","","","","","","","","","","","","","","","","","","","","","","","","","","","","","","","","","","","","","","","","","","","","","","","","","","","","","","","","",""]
[null,126,"TM 126",null,null,null,126,93,157,"TM 93","-","TM 157",0,":",2,null,126,"TM 146",13,5,1,7,20,":",30,-10,16,"","TM 146","","","","","","","2 : 9","","","","","1 : 2","","","","","","","","","","","3 : 0","","","","","","","","","","","","","","0 : 4","","","","","","3 : 0","","","","","","","","","","1 : 5","","","","","","","1 : 3","0 : 3","","","","","","","","","","0 : 0","","","","","","","","","","","","","","","","","","","","","","","","","","","","","","","","","","","0 : 2","","5 : 1","","","","","","","","","","","","","","","","","","","","","","","","","","","","","","","","","","","","","3 : 1","1 : 0","","","","","","","","","","","","","","","","","","","","","","","","","","","","","","","","","","","","","","","","","","","","","","","","","","","","","","","","","","",""]
[null,127,"TM 127",null,null,null,127,39,94,"FC Lille","-","TM 94",0,":",0,null,127,"TM 53",12,4,3,5,30,":",24,6,15,"","TM 53","","","","","","","","","","","","","","","","","","0 : 3","","0 : 0","","","","","","","","","","","","","0 : 0","2 : 5","","","","","","","","","","","2 : 5","4 : 0","","","","","","","","","","1 : 5","","","","","","","","","","","","","","0 : 0","","","","","","","","","","","3 : 0","","","","0 : 2","","","","","","","","","","","","","","","","","","9 : 2","","","","","","","","","","","","","","","","","","","","","","","","","","","","","","","","","","","","","","","","","","","","","","","","","","","","","","","","","","","","","","","","","","","","","","","","","","","","","","","","","","","","","","","","","","","","","","","","","","","","","",""]
[null,128,"TM 128",null,null,null,128,30,192,"FC Bologna","-","TM 192",0,":",3,null,128,"TM 65",12,4,3,5,22,":",21,1,15,"","TM 65","","","","","","","","","","","","","","2 : 5","","","","","","","","","","","","","","","","","","","","","","","","","","0 : 2","","","","","","","","","","","","","","","","","0 : 0","","","","","","","","","","","","","","","","","","","","","","","","","","","","","","","","","","","","0 : 3","","","","","","3 : 1","","","","","","","","","","","0 : 0","","","","","","","","","","","","","","","","","","","","","","","","","","5 : 1","","","","","","","9 : 2","","","","","0 : 4","","","","","","","","","","","","","","","","","","","","","","","3 : 0","","","","","","","","","","","","","","","","","","0 : 0","0 : 3","","","","","","","","","","","","","","",""]
[null,129,"TM 129",null,null,null,129,34,160,"Stade Brest","-","TM 160",0,":",0,null,129,"AC Mailand",13,4,3,6,21,":",21,0,15,"","AC Mailand","","","","","","","","","","","","","","","","","","","","","","","","","","0 : 0","","","","","","","","","","","","","","","","","","","","","1 : 3","","","","0 : 3","","","","","","","","","","","","","","","","","3 : 0","","","","","","","1 : 3","","","","","","","","","","","","","","","1 : 3","","","","","","","","","","","","","","","","","","","","","","","0 : 0","","","","0 : 0","","","","","","","","","","","","","3 : 0","","","","","","","","","","","","1 : 3","","","","","","","","","2 : 5","","","","","","","","","","","","","4 : 0","","","","","","","","5 : 1","","","","","","","","","","","","","","","","","","","","","","","","","","","","","","","","",""]
[null,130,"TM 130",null,null,null,130,106,129,{"$f":"IFERROR(VLOOKUP($H135,$B$6:$C$205,2,0),\"\")","v":"TM 106"},"-",{"$f":"IFERROR(VLOOKUP($I135,$B$6:$C$205,2,0),\"\")","v":"TM 129"},0,":",1,null,130,"TM 200",12,5,0,7,21,":",23,-2,15,"","TM 200","","","","","","","","","","","1 : 2","","","","","","","0 : 1","","1 : 3","","","","","","","","","","","","","","","","","","","","","","","","","3 : 0","1 : 3","","","","","","","","","","0 : 2","","","","","","","","","","","","","","","","","","","","","","","","","3 : 1","","","","2 : 5","","","","","","","","","","","","","1 : 5","","","","","","2 : 1","3 : 0","","4 : 0","","","","","","","","","","","","","","","","","","","","","","","","","","","","","","","","","","","","","","","","","","","","","","","","","","","","","","","","","","","","","","","","","","","","","","","","","","","","","","","","","","","","","","","","","","","","","","","","","",""]
[null,131,"TM 131",null,null,null,131,162,159,"TM 162","-","TM 159",3,":",0,null,131,"TM 169",12,4,3,5,16,":",18,-2,15,"","TM 169","","","","","","","","","","","","","","","","","","","","","","","","","","","","","","0 : 0","","0 : 2","","","","","","","","","","","","","","","","","","","","3 : 0","","","","","","4 : 0","","","","","","","","","","","","","","","","","","","0 : 3","","","","","","","5 : 2","","","0 : 1","","","","0 : 0","","","","","","","","","","0 : 0","","","","","","","","","","","","","","","","","","","","","","","","","","3 : 1","","","","","","1 : 5","","","","","","","","","","","","","","","","","","","","","","","","","","0 : 4","","","","","","","","","","","","","","","","","","","","","","","","","","","","","","","","","","","","","","","","","","","","","",""]
[null,132,"TM 132",null,null,null,132,148,147,"TM 148","-","TM 147",1,":",5,null,132,"TM 156",13,4,3,6,19,":",22,-3,15,"","TM 156","","","","","","","","","","","","","","","","","","","","","","","","","1 : 2","","","","","","","","","","0 : 0","2 : 9","","3 : 0","","","","","","","","","","0 : 0","","","","","","2 : 5","","","","","","","","0 : 2","","","","","0 : 1","","","","","3 : 1","","","","","","","0 : 0","","","4 : 0","","","","","","","","","","","","","4 : 0","","","","","","","","","","","","","","","","","","","","","","","","","0 : 2","","","","","","","","","","","","","","","","","","","","","","","","","","","","","","","","","","","","","","","","","","","","","","","","","","","","","","","","","","","","","","","","","","","","","","","","","","","","","","","","","","","","",""]
[null,133,"TM 133",null,null,null,133,36,183,"Mainz 05","-","TM 183",4,":",0,null,133,"Bayer Leverkusen",13,4,3,6,14,":",18,-4,15,"","Bayer Leverkusen","","","","","","","","","","","","","","","","","","","","","","","","","0 : 0","","","","","","","","","","0 : 2","","","0 : 1","","","","","","","","","","","","","","","","","","","","","","","","5 : 2","","","","","","","","","","4 : 0","","","","1 : 0","","","","0 : 3","","","","","","0 : 0","","","","","","","","1 : 3","0 : 0","","","","","","","","","","","","","","","","","","","","","3 : 1","","","","","","","","","","","","","","","","","","","","","","","","","","","","","","","","","","","","","","","","","","","","","","","","","0 : 4","","","","","","","","","","","","","","","","","","","","","","","0 : 2","","","","","","","","","","","","","","","","",""]
[null,134,"TM 134",null,null,null,134,180,182,"TM 180","-","TM 182",2,":",5,null,134,"TM 67",12,4,3,5,17,":",23,-6,15,"","TM 67","","","","","","","","","","","2 : 5","","","","","","","","","","","","","","","","","","","","","","","","","","","","","","","","","","","","","","","1 : 0","","","","","","","","","","","","","","","","","","","","","","","","","","","","3 : 0","","","","","1 : 3","","","","","","","","","","","","","","","0 : 3","","","","1 : 3","","4 : 0","","","0 : 0","","","","","","","","","","","","","","","","","","","","","","","","","","","","","","","","","","","","","","","","","","","","","","","","","","","0 : 0","","","","","","","","","3 : 0","","","","","","","","","","","","2 : 9","","","","","","","","","","","","","","","","","","","","","","","0 : 0","","",""]
[null,135,"TM 135",null,null,null,135,84,8,"TM 84","-","RB Leipzig",3,":",1,null,135,"TM 110",13,4,3,6,19,":",26,-7,15,"","TM 110","","","","","","","","","","3 : 0","","","","","","1 : 5","","","","","","0 : 0","","","","","2 : 5","","","","","","","","","","","","","","","","","","","","","","","","","","","","","","","","0 : 0","","","","4 : 0","3 : 1","","","","","","","","","","","","","","","","","","","","","","","","","4 : 0","","","","","","","","","","","2 : 9","","","","","","","","","","","","","","0 : 3","","","","","0 : 2","","0 : 0","","0 : 1","","","","","","","","","","","","","","","","","","","","","","","","","","","","","","","","","","","","","","","","","","","","","","","","","","","","","","","","","","","","","","","","","","","","","","","","","","","","","","","","","",""]
[null,136,"TM 136",null,null,null,136,110,194,"TM 110","-","TM 194",0,":",3,null,136,"Sturm Graz",13,4,3,6,18,":",28,-10,15,"","Sturm Graz","","","","","","","2 : 5","","","","","","","","","","","","","","","","0 : 3","","","","","","","","","","","","","","0 : 0","","","","","","4 : 0","","","","","","","","","","","","","","","","","1 : 3","3 : 0","","","","","","","","","","1 : 5","","","","","","","","","","","","","","","","","","","","","","","","","","","","","","","","","","","2 : 9","","0 : 0","","","","","","","","","","","","","","0 : 3","","","","","","","","","","","","","","","","","","","","","","","3 : 0","0 : 0","","","","","","","","","","","","","","","","","","","","","","","","","","2 : 0","","","","","","","","","","","","","","","","","","","","","","","","","","","","","","","","",""]
[null,137,"TM 137",null,null,null,137,99,89,"TM 99","-","TM 89",9,":",2,null,137,"VfB Stuttgart",13,4,3,6,17,":",28,-11,15,"","VfB Stuttgart","","","","","","","","","","","","","","","","","","","","","","","","","","","","","","","","","","","","","","","","","","","","","","","2 : 9","","","","","","","","","","","","","","","","","","","","","0 : 0","","","","","","","0 : 0","","","","","","","","","","","","","","","0 : 2","","","","","","","","","","","","","","","","","","","0 : 4","","","","0 : 3","","","","5 : 1","","","","","","","","","","","","","0 : 3","","","","3 : 1","","","","","","","","","","","","","","","","","2 : 0","","","","","","","","","","","","","0 : 3","","","","","","","","5 : 2","","","","","","","","","","","","","","","","","","","","","","","0 : 0","","","","","","","","","",""]
[null,138,"TM 138",null,null,null,138,7,16,"Borussia Dortmund","-","FC Brügge",3,":",1,null,138,"TM 114",12,4,3,5,15,":",26,-11,15,"","TM 114","","","","","","","","","","","","","","","","","","","","","","","","","","","","","","","","3 : 1","","","","","","","","","","","","","","","","","","","","","","","","","","1 : 5","","","","","","","","","","","","","","","","","","","1 : 0","","","","","","","0 : 4","","","0 : 0","","","","0 : 2","","","","","","","","","","0 : 3","","","","","","","","","","","","","","","","","","","","","","","","","","0 : 0","","","","","","2 : 9","","","","","","","","","","","0 : 0","","","","","","","","","","","","","","","5 : 1","","","","","","","","","","","","","","","","","","","","","","","","","3 : 1","","","","","","","","","","","","","","","","","","","","",""]
[null,139,"TM 139",null,null,null,139,163,87,"TM 163","-","TM 87",1,":",3,null,139,"TM 133",12,4,2,6,21,":",20,1,14,"","TM 133","","","","","","3 : 0","","0 : 1","","","","","","1 : 5","","","3 : 1","","","","","","","1 : 3","","","","","","","","","","","","","","","","0 : 0","","","","","","","","","","","","","","","","","0 : 3","","","","","","","","0 : 2","","","","","","","","","","","","","","","","","","","","","","","","","","","","0 : 3","","","","","","4 : 0","","","","","","","","","","","","","","","","","","","","","","","","","","","","","","","","","","","","","","","","","","","","0 : 0","","","","","","","","","","","","","","","","","","","","","","","","","","","","","","","","","","","","","","","","","","","","","","","9 : 2","","","","","","","","","","","","","","",""]
[null,140,"TM 140",null,null,null,140,176,74,"TM 176","-","TM 74",2,":",0,null,140,"Schachtjor Donezk",13,4,2,7,23,":",25,-2,14,"","Schachtjor Donezk",3,4,":",0,4,"","","","","","","","","","","","","","","","","","","","","","","","","","","","","","","","0 : 3","","","","","","","","","","","","","","","","","","","","","","","0 : 2","0 : 2","","","","","","","","","","0 : 4","","","","","","","","","","","","","","","","","","","","","","","","","","","","","","","","","","","5 : 1","","0 : 0","","","","","","","","","","","","","","0 : 0","","","","","","","","","1 : 3","","","","","","","","","","0 : 3","","","","","4 : 0","","","1 : 5","3 : 0","","","","","","","","","","","","","","","","","","","","","","9 : 2","","","","","","","","","","","","","","","","","","","","","","","","","","","","","","","","",""]
[null,141,"TM 141",null,null,null,141,178,91,"TM 178","-","TM 91",0,":",5,null,141,"PSV Eindhoven",13,4,2,7,23,":",25,-2,14,"","PSV Eindhoven",0,0,":",4,-4,"","","","","","","","","","","","","","","","","","","","","","","","","","","","","","","","1 : 3","","","","","","0 : 1","","","","","","","","","","","","","","","","","2 : 5","1 : 3","","","","","","","","","","0 : 0","","","","","","","","","","","","","","","","","","","","","","","","","","","","","","","","","","","0 : 3","","5 : 2","","","","","","","","","","","","","","9 : 2","","","","","","","","","0 : 1","","","","","","","","","","0 : 0","","","","0 : 4","","","","2 : 0","","","","","","","","","","","","","","","","","","","","","","","3 : 1","","","","","","","","","","","","","","","","","","","","","","","","","","","","","","","","",""]
[null,142,"TM 142",null,null,null,142,86,81,"TM 86","-","TM 81",3,":",0,null,142,"TM 79",12,4,2,6,17,":",19,-2,14,"","TM 79","","","","","","","","","","","1 : 3","","","","","","","0 : 0","","0 : 2","","","","","","","","","","","","","","","","","","","","","","","","","","1 : 5","","","","0 : 3","","","","","","3 : 0","","","","","","","","","","","","","","","","","","","","","","","","","3 : 0","","4 : 0","","3 : 0","","","","","","","","","","","","","0 : 0","","","","","","2 : 5","","","0 : 1","","","","","","","","","","","","","","","","","","","","","","","","","","","","","","","","","","","","","","","","","","","","","","","","","","","","","","","","","","","","","","","","","","","","","","","","","","","","","","","","","","","","","","","","","","","","","","","","","",""]
[null,143,"TM 143",null,null,null,143,108,85,"TM 108","-","TM 85",0,":",0,null,143,"TM 179",12,4,2,6,19,":",22,-3,14,"","TM 179","","","","","","","","","","","","","","","","","","","","","","","","","","","","","","0 : 1","","0 : 0","","0 : 2","","","","","","","","","","","","","","","","","","2 : 9","","","","","","2 : 5","","","","","","","","","","","","","","","","","","","0 : 0","","","","","","","1 : 3","","","3 : 0","","","","3 : 0","","","","","4 : 0","","","","","","","","","","","","","","","","","","","","","","","","","","","","","","","0 : 2","","","","","","4 : 0","","","","","","","","","","","","","","","","","","","","","","","","","","","","","","","","","","","","","","","","","","","","","","","","","","","","","","","","","","","","","","","","","","","","","","","",""]
[null,144,"TM 144",null,null,null,144,83,57,"TM 83","-","TM 57",1,":",0,null,144,"TM 153",13,4,2,7,21,":",25,-4,14,"","TM 153","","","","","","","4 : 0","","","","","2 : 5","","","","","","","","","","","1 : 2","","","","","","","","","","","","","","0 : 0","","","","","","1 : 3","","","","","","","","","","3 : 1","","","","","","","","0 : 0","","","","","","","","0 : 2","","5 : 2","","","","","","","","","","","","","","","","","","","","","","","","","","","","","","","","","","","0 : 4","","0 : 3","","","","","","","","","","","","","","","","","","","","","","","","","","","","","","","","","","","","","5 : 1","0 : 2","","","","","","","","","","","","","","","","","","","","","","","","","","","","","","","","","","","","","","","","","","","","","","","","","","","","","","","","","","",""]
[null,145,"TM 145",null,null,null,145,14,175,"Benfica Lissabon","-","TM 175",0,":",3,null,145,"TM 43",13,4,2,7,16,":",20,-4,14,"","TM 43","","","","","","","0 : 2","","","","","0 : 0","","","","","","","","","","","0 : 2","","","","","","","","","","","","","","3 : 1","","","","0 : 3","","3 : 0","","","","","","","","","","1 : 3","","","","","","","","5 : 2","","","","","","","","3 : 0","","0 : 1","","","","","","","","","","","","","","","","","","","","","","","","","","","","","","","","","","","0 : 0","","1 : 3","","","","","","","","","","","","","","","","","","","","","","","","","","","","","","","","","","","","","0 : 3","","","","","","","","","","","","","","","","","","","","","","","","","","","","","","","","","","","","","","","","","","","","","","","","","","","","","","","","","","","",""]
[null,146,"TM 146",null,null,null,146,174,68,"TM 174","-","TM 68",5,":",1,null,146,"TM 107",13,4,2,7,22,":",27,-5,14,"","TM 107","","","","","","","","","","2 : 9","","","","","","","","","","","","0 : 1","","","","1 : 3","","","","","","","","","","","","","","","","","","","","","5 : 1","","3 : 0","","0 : 3","","","","","","","","","","","","","","","","","4 : 0","","","","","0 : 0","","0 : 0","","","","","","","","","","","","","","2 : 5","0 : 1","","","","","","","","","","","","","","","","","","","","","","","","","","","","","","","","","","","","","","","","","","","","5 : 2","","","","","","","","0 : 2","","","","","","","","","","","","","","","","","","","","","","","","","","","","","","","","","","","","","","","","","","","","","","","","","","","","","","","","","","","","","","",""]
[null,147,"TM 147",null,null,null,147,118,10,"TM 118","-","Bayer Leverkusen",0,":",4,null,147,"TM 104",13,4,2,7,21,":",26,-5,14,"","TM 104","","","","","","","","","","","","","","","","","","","","","","","","","0 : 1","","","","","","","","","","0 : 0","","","3 : 0","","","","","","","","","","4 : 0","","","","","","2 : 9","","","","","","","","1 : 3","","","","","","","","","","2 : 5","","","","","","","","0 : 0","","","","","","","","","","","","","","4 : 0","0 : 3","","","","","","","","","","","","","","","","","","","","","0 : 2","","","","","","","","","","","","","","","","","","","","","","","","","","","","","","","","","","","","","","","","","","","","","","","","","5 : 2","","","","","","","","","","","","","","","","","","","","","","","","","","","","","","","","","","","","","","","",""]
[null,148,"TM 148",null,null,null,148,19,171,"Feyenoord Rotterdam","-","TM 171",5,":",2,null,148,"TM 100",12,4,2,6,18,":",23,-5,14,"","TM 100","","","","","","","","","","","","","","","","","","1 : 3","","","","","","","","","","","","0 : 0","","1 : 3","3 : 1","0 : 0","","","","","","","","","","","3 : 0","","","","","","","2 : 5","","","","","","3 : 0","","","","","","","","","","","","0 : 3","","","","","","","","","","","","","","","","","","","","","","","","","","3 : 0","","","","","","","1 : 5","","1 : 3","","","","","","","","","","","","","","","","","","","","","","","","","","","","","","","","","","","","","","","","","","","","","","","","","","","","","","","","","","","","","","","","","","","","","","","","","","","","","","","","","","","","","","","","","","","","","","","","","","","",""]
[null,149,"TM 149",null,null,null,149,88,77,"TM 88","-","TM 77",3,":",1,null,149,"TM 55",12,4,2,6,18,":",24,-6,14,"","TM 55","","","","","","","","","","","","","","","","","","","","","","","","","","","","","","1 : 5","","0 : 0","0 : 1","2 : 9","","","","","","","","","","","3 : 0","","","","","","","2 : 5","","","","","","3 : 1","","","","","","","","","","","","","","","","","","","","","","","","","","","","","3 : 0","","","","","","","","","0 : 0","","","","","","","0 : 2","","0 : 1","","","","","","","","","","","","","","","","","","","","","","","","","","","","","","","","","","","","","","","","","","","","","","","","","","","","","","","","","","","","","","","","","","","","","","","","","","","","","","","","","","","","","","","","","","","","","","","","","","","",""]
[null,150,"TM 150",null,null,null,150,6,44,"Inter Mailand","-","TM 44",0,":",3,null,149,"TM 81",13,4,2,7,18,":",24,-6,14,"","TM 81","","","","","","0 : 0","","0 : 2","","","","","5 : 2","","3 : 1","","1 : 3","","","","","","","2 : 5","","","","","0 : 0","","0 : 1","","","","","","","","3 : 0","","","0 : 3","","1 : 3","","","","","","","","","","","","","","","","","","","","","3 : 0","","","","","","","","","","","","","","","","","","","","","","","","","","","","","","","","","","","","","","","","","","","","","","0 : 4","","","","","","","","","","","","","","","","","","","","","","","","","","","","","","","","","","","","","","","","","","","","","","","","","","","","","","","","","","","","","","","","","","","","","","","","","","","","","","","","","","","","","","","","","","","","","",""]
[null,151,"TM 151",null,null,null,151,48,104,"TM 48","-","TM 104",9,":",2,null,151,"TM 126",13,4,2,7,20,":",26,-6,14,"","TM 126","","","","","","","1 : 3","","","","","5 : 1","","","","","","","","","","","0 : 0","","","","","","","","","","","","","","0 : 3","","","","3 : 0","","2 : 5","","","","","","","","","","0 : 1","","1 : 5","","","","","","","","","","","","","","3 : 1","","4 : 0","","","0 : 2","","","","","","","","","","","","","","","","","","","","","","","","","","","","","","","","1 : 5","","0 : 0","","","","","","","","","","","","","","","","","","","","","","","","","","","","","","","","","","","","","","","","","","","","","","","","","","","","","","","","","","","","","","","","","","","","","","","","","","","","","","","","","","","","","","","","","","","","","","","","",""]
[null,152,"TM 152",null,null,null,152,134,63,"TM 134","-","TM 63",2,":",1,null,152,"TM 102",13,4,2,7,16,":",23,-7,14,"","TM 102","","","","","","","","","","","","","","","","","","","","","","","","","0 : 0","","","","","","","","","","1 : 3","0 : 0","","0 : 3","","","","","","","","","","3 : 0","","","","","","0 : 2","","","","","","","","1 : 3","","","","","3 : 1","","","","","3 : 0","","","","","","","1 : 3","","","0 : 3","","","","","","","","","","3 : 0","","","","","","","","","","","","","","","","","","","","","","","","","","","","1 : 5","","","","","","","","","","","","","","","","","","","","","","","","","","","","","","","","","","","","","","","","","","","","","","","","","","","","","","","","","","","","","","","","","","","","","","","","","","","","","","","","","","","","",""]
[null,153,"TM 153",null,null,null,153,25,145,"OSC Lille","-","TM 145",1,":",3,null,153,"TM 61",12,4,2,6,14,":",21,-7,14,"","TM 61","","","","","","","","","","","","","","","","","","","","","","","","","","","","","","","","","","","","","","","","","","","","","","","","","","","","","","","","","","","","","","","","","","","0 : 3","","","","","","","","","","","","0 : 0","","","3 : 0","","","","","","","","","","0 : 2","","","","","1 : 3","","","","","","","","","","","","","","","","","","0 : 3","","","","","3 : 1","","","","","","","","","","","","","","","","","","","0 : 0","","","","","","","","","","","","","","","","","","","","","","","","","","","","","","","","","","","","","","1 : 5","","","0 : 3","","3 : 1","","","3 : 0","","","","","","","","","","","","","","","","","","","",""]
[null,154,"TM 154",null,null,null,154,75,49,"TM 75","-","TM 49",2,":",0,null,154,"TM 51",12,4,2,6,18,":",26,-8,14,"","TM 51","","","","","","2 : 5","","","","","","","","1 : 3","","","0 : 3","","","","","","","","","","","","","","","","","","","","","","","0 : 1","","","","","","","","","","","","","","","","","3 : 0","","","","","","","","0 : 0","","","","","","","","","","","","","","","","","","","","","","","","","","","","2 : 9","","","","","","3 : 0","","","","","","","","","","","0 : 0","","","","","","","","","","","","","","","","","","","","","","","","","","4 : 0","","","","","","","1 : 5","","","","","","","","","","","","","","","","","","","","","","","","","","","","","","","","","","","","","","","","","","","","","","","2 : 0","","","","","","","","","","","","","","",""]
[null,155,"TM 155",null,null,null,155,40,158,"Hertha BSC","-","TM 158",0,":",0,null,155,"TM 77",13,4,2,7,17,":",25,-8,14,"","TM 77","","","","","","","","","","","","","","","","","","","","","","","","","1 : 3","","","","","","","","","","1 : 5","","","3 : 1","","","","","","","","","","","","","","","","3 : 0","","","","","","","","0 : 0","","","","","","","","","","0 : 3","","","","","","","","0 : 2","","","","","","1 : 3","","","","","","","","0 : 0","0 : 4","","","","","","","","","","","","","","","","","","","","","3 : 0","","","","","","","","","","","","","","","","","","","","","","","","","","","","","","","","","","","","","","","","","","","","","","","","","0 : 3","","","","","","","","","","","","","","","","","","","","","","","5 : 1","","","","","","","","","","","","","","","","",""]
[null,156,"TM 156",null,null,null,156,132,113,"TM 132","-","TM 113",3,":",0,null,156,"TM 93",13,4,2,7,21,":",30,-9,14,"","TM 93","","","","","","","","","","2 : 5","","","","","","0 : 0","","","","","","1 : 2","","","","0 : 2","0 : 2","","","","","","","","","","","","","","","","","","","","2 : 9","","3 : 0","","4 : 0","","","","","","","","0 : 1","","","","","2 : 9","","","","","","","","","0 : 0","","","","","","","","","","","","","","","","3 : 0","","","","","","","","","","","","","","","","","","","","","","","","","","","","","","","","","","4 : 0","","","","","","","","","","","","","","","","","","","","","","","","","","","","","","","","","","","","","","","","","","","","","","","","","","","","","","","","","","","","","","","","","","","","","","","","","","","","","","","","","",""]
[null,157,"TM 157",null,null,null,157,46,4,"TM 46","-","Paris Saint-Germain",0,":",0,null,157,"TM 57",13,4,2,7,18,":",27,-9,14,"","TM 57","","","","","","2 : 9","","3 : 0","","","","","0 : 1","1 : 3","1 : 5","","0 : 3","","","","","","","4 : 0","","","","","3 : 1","","0 : 2","","","","","","","","0 : 0","","","1 : 3","","3 : 0","","","","","","","","","","","","","","","","","","","","","","","","","","","","","","","","","","","","","","","","","","","","","","","","","","","","","","","","","","","","","","","","","","","","","","","","","","","","","","","","","","","","","","","","","","","","","","","","","","","","","","","","","","","","","","","","","","","","","","","","","","","","","","","","","","","","","","","","","","","","","","","","","","","","","","","","","","","","","","","","",""]
[null,158,"TM 158",null,null,null,158,29,133,"Aston Villa","-","TM 133",1,":",0,null,158,"TM 112",12,4,2,6,17,":",26,-9,14,"","TM 112","","","","","","","","","","","0 : 0","","","","","","","3 : 1","","1 : 3","","","","","","","","","","","","","","","","","","","","","","","","","3 : 1","0 : 1","","","","","","","","","","0 : 0","","","","","","","","","","","","","","0 : 2","","","","","","","","","","","0 : 3","","","","2 : 9","","","","","","","","","","","","","","","","","","3 : 1","","2 : 5","","3 : 0","","","","","","","","","","","","","","","","","","","","","","","","","","","","","","","","","","","","","","","","","","","","","","","","","","","","","","","","","","","","","","","","","","","","","","","","","","","","","","","","","","","","","","","","","","","","","","","","","",""]
[null,159,"TM 159",null,null,null,159,5,72,"FC Liverpool","-","TM 72",0,":",3,null,159,"TM 116",13,4,2,7,16,":",26,-10,14,"","TM 116","","","","","","","","","","","","","","","","","","","","","","","","","","5 : 2","","","","","","","","","","","","","","","","","","","","","0 : 3","","0 : 1","","0 : 0","","","","","","","","","","","","","","","","","1 : 3","","","","","0 : 2","","0 : 2","","","","","","","","","","","","","","4 : 0","0 : 0","","","","","","","","","","","","","","","","","","","","","","","1 : 0","","","","","","","","","","","","","","","","","","","","","0 : 4","","","","","","","","3 : 0","","","","","","","","","","","","","","","","","","","","","","","","","","","","","","2 : 9","","","","","","","","","","","","","","","","","","","","","","","","","","","","","","","","",""]
[null,160,"TM 160",null,null,null,160,144,2,"TM 144","-","Manchester City",5,":",1,null,160,"Stade Brest",13,4,2,7,22,":",33,-11,14,"","Stade Brest","","","","","","","","","3 : 0","","","2 : 5","","","","","","","2 : 9","","1 : 5","","","","","","","1 : 5","","","","","","","","","","","","","1 : 3","","","","","","","","","","","","","","3 : 0","","","","","","","","","","","0 : 0","","","0 : 0","","","","","0 : 1","","","","","","","","","","","","","","","","","","","","","","","","","","","","","","","","","","","","","","","","","","","","","","","","","","","","","","","","","","","","","","","","4 : 0","","","","","","","","","","","","","","2 : 5","","","","","","","","3 : 0","","","","","","","","","","","","","","","","","","","","","","","","","","","","","","","","","","","","","","","","","","","","",""]
[null,161,"TM 161",null,null,null,161,66,156,"TM 66","-","TM 156",0,":",4,null,161,"TM 72",13,4,2,7,20,":",31,-11,14,"","TM 72","","","","","","","","","","","","","","","","","","","","","","","","","1 : 5","","","","","","","","","","2 : 9","0 : 3","","0 : 0","","","","","","","","","","1 : 3","","","","","","3 : 1","","","","","","","","2 : 5","","","","","1 : 3","","","","","3 : 0","","","","","","","","3 : 0","","0 : 0","","","","","","","","","","","","","1 : 2","","","","","","","","","","","","","","","","","","","","","","","","","3 : 0","","","","","","","","","","","","","","","","","","","","","","","","","","","","","","","","","","","","","","","","","","","","","","","","","","","","","","","","","","","","","","","","","","","","","","","","","","","","","","","","","","","","",""]
[null,162,"TM 162",null,null,null,162,173,51,"TM 173","-","TM 51",5,":",2,null,162,"TM 69",13,4,2,7,19,":",30,-11,14,"","TM 69","","","","","","","","","","","","","","","","","","","","","","","","","0 : 0","","","","","","","","","","","3 : 1","","","","","","","","","","","","1 : 5","","","","","","3 : 0","","","","","","","","","","","","","3 : 1","","","","","","","","","","","","2 : 9","","","0 : 1","","","","","","","","","","4 : 0","","","","","0 : 0","","","","","","","","","","","","","","","","","","0 : 2","","","","","2 : 5","","","","","","","","","","","","","","","","","","","0 : 3","","","","","","","","","","","","","","","","","","","","","","","","","","","","","","","","","","","","","","1 : 3","","","","","","","","","","","","","","","","","","","","","","","","","","","",""]
[null,163,"TM 163",null,null,null,163,151,102,"TM 151","-","TM 102",3,":",1,null,163,"TM 148",13,4,2,7,18,":",30,-12,14,"","TM 148","","","","","","","","","","1 : 3","","","","","","2 : 9","","","","","","0 : 3","","","","","","","","","","","","","","","","","","","","","","","","","","","0 : 0","","","","","","","","","","0 : 2","","","","1 : 5","0 : 1","","","","","","","","","3 : 1","","","","","","","","","","","","","","","","1 : 5","","","","","","","","","","","3 : 0","","","","","","","","","","","","","","","","","","","3 : 1","","","","0 : 0","","","","","","","","","","","","","","","","","","","","","","","","","","","","","","","","","","","","","","","","","","","","","","","","","","","","","","","","","","","","","","","","","","","","","","","","","","","","","","","","","",""]
[null,164,"TM 164",null,null,null,164,181,127,"TM 181","-","TM 127",0,":",3,null,164,"TM 150",13,4,2,7,16,":",28,-12,14,"","TM 150","","","","","","","0 : 3","","","","","2 : 9","","","","","","","","","","","4 : 0","","","","","","","","","","","","","","1 : 5","","","","1 : 3","","0 : 0","","","","","","","","","","0 : 3","","","","","","","","2 : 1","","","","","","","","0 : 0","","0 : 2","","","0 : 1","","","","","","","","","","","","","","","","","","","","","","","","","","","","","","","","3 : 1","","3 : 0","","","","","","","","","","","","","","","","","","","","","","","","","","","","","","","","","","","","","","","","","","","","","","","","","","","","","","","","","","","","","","","","","","","","","","","","","","","","","","","","","","","","","","","","","","","","","","","","",""]
[null,165,"TM 165",null,null,null,165,64,3,"TM 64","-","FC Bayern München",9,":",2,null,165,"TM 78",13,4,2,7,23,":",36,-13,14,"","TM 78","","","","","","","3 : 0","","2 : 5","","","1 : 5","","","","","","","","","","","3 : 0","","","","","","","","","","","","","","5 : 3","","","","0 : 0","","0 : 1","","","","","","","","","","2 : 9","","0 : 3","","","","","","","","","","","","","","1 : 5","","0 : 0","","","4 : 0","","","","","","","","","","","","","","","","","","","","","","","","","","","","","","","","","","2 : 5","","","","","","","","","","","","","","","","","","","","","","","","","","","","","","","","","","","","","","","","","","","","","","","","","","","","","","","","","","","","","","","","","","","","","","","","","","","","","","","","","","","","","","","","","","","","","","","","",""]
[null,166,"TM 166",null,null,null,166,142,195,"TM 142","-","TM 195",3,":",1,null,166,"TM 121",12,4,1,7,17,":",22,-5,13,"","TM 121","","","","","","","","","","","","","","","","","","","","","","","","","","","","","","3 : 0","","4 : 0","0 : 3","1 : 3","","","","","","","","","","","","","","","","","","1 : 5","","","","","","0 : 0","","","","","","","","","","","","","","","","","","","1 : 3","","","","","","","1 : 2","","","0 : 2","","","","3 : 0","","","","","3 : 1","","","","","","","","","","","","","","","","","","","","","","","","","","","","","","","","","","","","","0 : 3","","","","","","","","","","","","","","","","","","","","","","","","","","","","","","","","","","","","","","","","","","","","","","","","","","","","","","","","","","","","","","","","","","","","","","","",""]
[null,167,"TM 167",null,null,null,167,154,103,"TM 154","-","TM 103",1,":",3,null,167,"TM 137",13,4,1,8,29,":",36,-7,13,"","TM 137","","","","","","","","","","","","","","","","","","","","","","","","","","","","","","","","","","","","","","","","","","","","","","","","","","","","","","","","","","","","3 : 1","0 : 1","","","","","","","3 : 4","","","","","","","1 : 3","","","","","","","","","","","","","","","4 : 0","","","","","","","","","","","","","","","","0 : 0","","","","","","","3 : 1","","","","","","","","","","","","","","","","","","","","","1 : 5","","","","","","","0 : 2","2 : 5","","","2 : 9","1 : 3","","","","","","","","","","","","","","","","","","9 : 2","","","","","","","","","","","","","","","","","","","","","","","","","","","","","","","","","","","","","","","","",""]
[null,168,"TM 168",null,null,null,168,70,65,"TM 70","-","TM 65",2,":",0,null,168,"Celtic Glasgow",12,4,1,7,21,":",28,-7,13,"","Celtic Glasgow","","","","","","","","","","","3 : 0","","","","","","","2 : 5","","4 : 0","","","","","","","","","","","","","","","","","","","","","","","","","0 : 0","0 : 3","","","","1 : 3","","","","","","4 : 0","","","","","","","","","","","","","","","","","","","","","","","","","1 : 5","","","","","","","","","","","","","","","","","3 : 0","","","","","","0 : 1","","","2 : 9","","","","","","","","","","","","","","","","","","","","","","","","","","","","","","","","","","","","","","","","","","","","","","","","","","","","","","","","","","","","","","","","","","","","","","","","","","","","","","","","","","","","","","","","","","","","","","","","","",""]
[null,169,"TM 169",null,null,null,169,67,172,"TM 67","-","TM 172",0,":",0,null,169,"TM 125",12,4,1,7,17,":",24,-7,13,"","TM 125","","","","","","","","","","","","","","","","","","1 : 3","","2 : 0","","","","","","","","","","0 : 3","","","0 : 2","1 : 3","","","","","","","","","","","1 : 5","1 : 5","","","","","","1 : 3","","","","","","","","","","","","","","","","","","0 : 0","","","","","","","","","","","","","","","","","","","","","","","","","","3 : 0","","","","","","","4 : 0","","3 : 0","","","","","","","","","","","","","","","","","","","","","","","","","","","","","","","","","","","","","","","","","","","","","","","","","","","","","","","","","","","","","","","","","","","","","","","","","","","","","","","","","","","","","","","","","","","","","","","","","","","",""]
[null,170,"TM 170",null,null,null,170,155,196,"TM 155","-","TM 196",3,":",0,null,170,"TM 63",12,4,1,7,20,":",28,-8,13,"","TM 63","","","","","","1 : 3","","2 : 5","","","","","","0 : 1","1 : 2","","0 : 2","","","","","","","3 : 1","","","","","","","1 : 5","","","","","","","","4 : 0","3 : 0","","","","","","","","","","","","","","","","","2 : 9","","","","","","","","0 : 0","","","","","","","","","","","","","","","","","","","","","","","","","","","","","","","","","","3 : 0","","","","","","","","","","","","","","","","","","","","","","","","","","","","","","","","","","","","","","","","","","","","","","","","","","","","","","","","","","","","","","","","","","","","","","","","","","","","","","","","","","","","","","","","","","","","","","","","","","","","","","","","","",""]
[null,171,"TM 171",null,null,null,171,193,69,"TM 193","-","TM 69",0,":",0,null,171,"TM 44",12,4,1,7,20,":",29,-9,13,"","TM 44","","","","","","3 : 1","","1 : 2","","","","","","2 : 5","3 : 0","","4 : 0","","","","","","","1 : 5","","","","","","","3 : 0","","","","","","","","2 : 9","0 : 0","","","","0 : 1","","","","","","","","","","","","","","","","","","","","","0 : 3","","","","","","","","","","","","","","","","","","","","","","","","","","","","","","","","","","1 : 3","","","","","","","","","","","","","","","","","","","","","","","","","","","","","","","","","","","","","","","","","","","","","","","","","","","","","","","","","","","","","","","","","","","","","","","","","","","","","","","","","","","","","","","","","","","","","","","","","","","","","","","","","",""]
[null,172,"TM 172",null,null,null,172,28,90,"AS Monaco","-","TM 90",1,":",0,null,172,"FC Barcelona",12,4,1,7,21,":",32,-11,13,"","FC Barcelona","","","","","","","","","","","2 : 9","","","","","","","","","","","","","","","","","","","","","","","","","","","","","","","","","","","","","","","0 : 4","","","","","","","","","","","","","","","","","","","","","","","","","","","","0 : 3","","","1 : 2","","0 : 0","","4 : 0","","","","","","","","","","","","","5 : 2","","","","","","0 : 3","","","1 : 5","","","","","","","","","","","","","","","","","","","","","","","","","","","","","","","","","","","","","","","","","","","","","","","","","","","5 : 1","","","","","","","","","3 : 1","","","","","","","","","","","","0 : 2","","","","","","","","","","","","","","","","","","","","","","","","","",""]
[null,173,"TM 173",null,null,null,173,9,170,"FC Barcelona","-","TM 170",0,":",3,null,173,"FC Arsenal",12,4,1,7,18,":",30,-12,13,"","FC Arsenal","","","","","","","","","","","","","","","","","","","","","","","","","","","","","","2 : 9","","0 : 3","0 : 0","3 : 0","","","","","","","","","","","","","","","","","","4 : 0","","","","","","0 : 1","","","","","","","","","","","","1 : 5","","","","","","","","","","","","","","3 : 1","","","1 : 3","","","","1 : 5","","","","","0 : 2","","","","","","","3 : 1","","","","","","","","","","","","","","","","","","","","","","","","","","","","","","","","","","","","","","","","","","","","","","","","","","","","","","","","","","","","","","","","","","","","","","","","","","","","","","","","","","","","","","","","","","","","","","","","","","","","","",""]
[null,174,"TM 174",null,null,null,174,152,149,"TM 152","-","TM 149",5,":",1,null,174,"TM 141",12,3,3,6,19,":",19,0,12,"","TM 141","","","","","","","","","","","","","","","","","","","","","","","","","","","","","","","","","","","","0 : 2","","","","","","","","","","","","","","","","","","","","","","","","","","","","","","","0 : 3","","","","","","","","","","","","1 : 3","","","1 : 3","","","","","","","","","","2 : 5","","","","","0 : 1","","","","","","","","","","","","","","","","","","0 : 0","","","","","0 : 0","","","","","","","","","","","","","","","","","","","9 : 2","","","","","","","","","","","","","","","","","","","","","","","","","","","","","","","","","","","","","","2 : 0","","","","","0 : 0","","","4 : 0","","","","","","","","","","","","","","","","","","","",""]
[null,175,"TM 175",null,null,null,175,26,141,"Roter Stern Belgrad","-","TM 141",0,":",4,null,175,"TM 119",12,3,3,6,14,":",20,-6,12,"","TM 119","","","","","","","","","","","0 : 3","","","","","","","","","0 : 1","","","","","","","","","","","","","","","","","","","","","","","","","","3 : 1","","","","1 : 5","","","","","","1 : 3","","","","","","","","","","","","","","","","","","","","","","","","","0 : 0","","0 : 2","","0 : 0","","","","","","","","","","","","","4 : 0","","","","","","0 : 0","","","2 : 5","","","","","","","","","","","","","","","","","","","","","","","","","","","","","","","","","","","","","","","","","","","","","","","","","","","3 : 0","","","","","","","","","","","","","","","","","","","","","","","","","","","","","","","","","","","","","","","","","","","","","","",""]
[null,176,"TM 176",null,null,null,176,167,143,"TM 167","-","TM 143",5,":",2,null,176,"TM 74",13,3,3,7,17,":",28,-11,12,"","TM 74","","","","","","2 : 5","","4 : 0","","","","","0 : 0","","0 : 0","","3 : 1","","","","","","","1 : 2","","","","","0 : 4","","5 : 2","","","","","","","","1 : 5","","","1 : 1","","0 : 3","","","","","","","","","","","","","","","","","","","","","","","","","","","","","","","","","","","","","","","","","","","","0 : 3","","","","","","","","","","","","","","","","","","","","","","","0 : 2","","","","","","","","","","","","","","","","","","","","","","","","","","","","","","","","","","","","","","","","","","","","","","","","","","","","","","","","","","","","","","","","","","","","","","","","","","","","","","","","","","","","","","","","","","","","","",""]
[null,177,"TM 177",null,null,null,177,41,61,"TM 41","-","TM 61",1,":",3,null,177,"TM 41",12,3,3,6,13,":",24,-11,12,"","TM 41","","","","","","","","","","","1 : 5","","","","","","","","","2 : 9","","","","","","","","","","","","","","","","","","","","","","","","","","","","","","3 : 1","","","","","","0 : 3","","","","","","","","","","","","","","","","","","","","","","","","","0 : 0","","0 : 1","","3 : 0","","","","","","","","","","","","","0 : 2","","","","","","3 : 0","","","0 : 0","","","","","","","","","","","","","","","","","","","","","","","","","","","","","","","","","","","","","","","","","","","","","","","","","","","1 : 3","","","","","","","","","","","","","","","","","","","","","0 : 0","","","","","","","","","","","","","","","","","","","","","","","","","",""]
[null,178,"TM 178",null,null,null,178,114,128,"TM 114","-","TM 128",3,":",1,null,178,"TM 92",12,4,0,8,19,":",31,-12,12,"","TM 92","","","","","","","","","","","","","","","","","","3 : 0","","0 : 1","","","","","","","","","","","","","0 : 2","4 : 0","","","","","","","","","","","2 : 9","3 : 0","","","","","","0 : 1","","","","1 : 3","","","","","","","","","","","","","","1 : 3","","","","","","","","","","","","","","","","","","","","","","","","","","2 : 9","","","","","","","0 : 3","","3 : 0","","","","","","","","","","","","","","","","","","","","","","","","","","","","","","","","","","","","","","","","","","","","","","","","","","","","","","","","","","","","","","","","","","","","","","","","","","","","","","","","","","","","","","","","","","","","","","","","","","","",""]
[null,179,"TM 179",null,null,null,179,119,80,"TM 119","-","TM 80",0,":",2,null,179,"Manchester City",12,3,2,7,15,":",23,-8,11,"","Manchester City","","","","","","0 : 0","","0 : 2","","","","","","0 : 3","","","1 : 5","","","","","","","","","","","","","","","","","","","","","","","2 : 5","","","","","","","","","","","","","","","","","1 : 3","","","","","","","","4 : 0","","","","","","","","","","","","","","","","","","","","","","","","","","","","","","","","","","0 : 0","","","","","","","","","","","3 : 0","","","","","","","","","","","","","","","","","","","","","","","","","","","","","","","","","1 : 3","","","","","","","","","","","","","","","","","","","","","","","","","","","","","","","","","","","","","","","","","","","","","","","0 : 1","","","","","","","","","","","","","","",""]
[null,180,"TM 180",null,null,null,180,135,50,"TM 135","-","TM 50",4,":",0,null,180,"Roter Stern Belgrad",12,3,2,7,15,":",25,-10,11,"","Roter Stern Belgrad","","","","","","","","","","","3 : 1","","","","","","","","","","","","","","","","","","","","","","","","","","","","","","","","","","","","","","","0 : 0","","","","","","1 : 3","","","","","","","","","","","","","","","","","","","","","","0 : 0","","","2 : 5","","5 : 2","","0 : 2","","","","","","","","","","","","","0 : 1","","","","","","1 : 3","","","3 : 1","","","","","","","","","","","","","","","","","","","","","","","","","","","","","","","","","","","","","","","","","","","","","","","","","","","0 : 3","","","","","","","","","","","","","","","","","","","","","0 : 4","","","","","","","","","","","","","","","","","","","","","","","","","",""]
[null,181,"TM 181",null,null,null,181,79,37,"TM 79","-","AC Roma",0,":",3,null,180,"TM 68",13,3,2,8,15,":",25,-10,11,"","TM 68","","","","","","0 : 1","","1 : 3","","","","","0 : 2","3 : 0","0 : 3","","1 : 3","","","","","","","0 : 0","","","","","1 : 5","","4 : 0","","","","","","","","2 : 5","0 : 2","","","","0 : 0","","","","","","","","","","","","","","","","","","","","","","","","","","","","","","","","","","","","","","","","","","","","","","","","","","","","","","","","","","","","","","","","","","","","","","","","","","","","","","","","","","","","","","","","","","","","","","","","","","","","","","","","","","","","","","","","","","","","","","","","","","","","","","","","","","","","","","","","","","","","","","","","","","","","","","","","","","","","","","","","",""]
[null,182,"TM 182",null,null,null,182,169,96,"TM 169","-","TM 96",0,":",0,null,182,"Atletico Madrid",13,3,2,8,19,":",29,-10,11,"","Atletico Madrid","","","","","","","","","","","","","","","","1 : 3","","","","","","1 : 5","","","","2 : 5","3 : 4","","","","","","","","","","","","","","","","","","","","3 : 0","","0 : 0","","1 : 2","","","","","","","","1 : 3","","","","","0 : 3","","","","1 : 3","","","","","0 : 0","","","","","","","","","","","","","","","","3 : 0","","","","","","","","","","","","","","","","","","","","","","","","","","","","","","","","","","","","","","","","","","","","","","","","","","","","","","","","","","","","","","","","","","","","","","","","","","","","","","","","","","","","","","","","","","","","","","","","","","","","","","","","","","","","","","","","","","","",""]
[null,183,"TM 183",null,null,null,183,22,82,"Celtic Glasgow","-","TM 82",0,":",1,null,183,"FC Lille",13,3,2,8,15,":",26,-11,11,"","FC Lille","","","","","","","","","1 : 3","","","0 : 0","","","","","","","0 : 1","","0 : 1","","","","","","","1 : 3","","","","","","","","","","","","","0 : 3","","","","","","","","","","","","1 : 5","","0 : 0","","","","","","","","","","","3 : 0","","","4 : 0","","","","","2 : 5","","","","","","","","","","","","","","","","","","","","","","","","","","","","","","","","","","","","","","","","","","","","","","","","","","","","","","","","","","","","","","","","2 : 0","","","","","","","","","","","","","","","","","","","","","","1 : 5","","","","","","","","","","","","","","","","","","","","","","","","","","","","","","","","","","","","","","","","","","","","",""]
[null,184,"TM 184",null,null,null,184,101,139,"TM 101","-","TM 139",3,":",0,null,183,"TM 101",12,3,2,7,15,":",26,-11,11,"","TM 101","","","","","","","","","","","","","","","","","","","","","","","","","","","","","","1 : 3","","1 : 5","","","","","","","","","","","","","","","","","","","","3 : 0","","","","","","0 : 3","","","","","","","","","","","","","","","","","","","2 : 5","","","","","","","0 : 0","","","3 : 1","","","","0 : 4","","","","","1 : 2","","","","","1 : 3","","","","","","","","","","","","","","","","","","","","","","","","","","3 : 0","","","","","","0 : 0","","","","","","","","","","","","","","","","","","","","","","","","","","","","","","","","","","","","","","","","","","","","","","","","","","","","","","","","","","","","","","","","","","","","","","","",""]
[null,185,"TM 185",null,null,null,185,200,123,"TM 200","-","TM 123",1,":",5,null,185,"TM 167",12,3,2,7,14,":",26,-12,11,"","TM 167","","","","","","","","","","","","","","","","","","","","","","","","","","","","","","","","0 : 1","","","","","","","","","","","","","","","","","","","","","","","","","","","","","","","","","","","","","","","","","","","","","1 : 3","","","","","","","0 : 0","","","5 : 2","","","","0 : 3","","","","","","","","","","1 : 3","","","","","","","","","","","","","","","","","","","","","","","","","","1 : 3","","","","","","3 : 0","","","","","","","","","","","2 : 9","","","","","","","","","","","","","","","0 : 2","","","","","","","","","","","","","","","","","","","","","","","","","1 : 0","","","","","","","","","0 : 0","","","","","","","","","","","",""]
[null,186,"TM 186",null,null,null,186,179,124,"TM 179","-","TM 124",4,":",0,null,186,"TM 49",12,3,2,7,17,":",31,-14,11,"","TM 49","","","","","","0 : 3","","0 : 0","","","","","","0 : 0","2 : 5","","3 : 0","","","","","","","1 : 3","","","","","","","","","","","","","","","0 : 2","1 : 5","","","","","","","","","","","","","","","","","4 : 0","","","","","","","","2 : 9","","","","","","","","","","","","","","","","","","","","","","","","","","","","3 : 1","","","","","","1 : 3","","","","","","","","","","","","","","","","","","","","","","","","","","","","","","","","","","","","","","","","","","","","","","","","","","","","","","","","","","","","","","","","","","","","","","","","","","","","","","","","","","","","","","","","","","","","","","","","","","","","","","","","","",""]
[null,187,"TM 187",null,null,null,187,1,56,"Real Madrid","-","TM 56",2,":",5,null,186,"TM 165",13,3,2,8,17,":",31,-14,11,"","TM 165","","","","","","","0 : 0","","4 : 0","","","0 : 3","","","","","","","3 : 1","","2 : 5","","1 : 3","","","","","0 : 2","","","","","","","","","","","","","0 : 0","","0 : 2","","","","","","","","","","3 : 0","","1 : 3","","","","","","","","","","","","","","2 : 9","","","","","1 : 3","","","","","","","","","","","","","","","","","","","","","","","","","","","","","","","","","","","","","","","","","","","","","","","","","","","","","","","","","","","","","","","","","","","","","","","","","","","","","","","","","","","","","","","","","","","","","","","","","","","","","","","","","","","","","","","","","","","","","","","","","","","","","","","","","","",""]
[null,188,"TM 188",null,null,null,188,121,58,"TM 121","-","TM 58",1,":",3,null,188,"TM 113",12,3,2,7,15,":",29,-14,11,"","TM 113","","","","","","1 : 3","","2 : 9","","","","","","3 : 1","","","0 : 0","","","","","","","0 : 3","","","","","","","","","","","","","","","1 : 4","3 : 0","","","","","","","","","","","","","","","","","0 : 2","","","","","","","","0 : 1","","","","","","","","","","","","","","","","","","","","","","","","","","","","3 : 1","","","","","","2 : 5","","","","","","","","","","","","","","","","","","","","","","","","","","","","","","","","","","","","","","","","","","","","","","","","","","","","","","","","","","","","","","","","","","","","","","","","","","","","","","","","","","","","","","","","","","","0 : 0","","","","","","","","","","","","","","",""]
[null,189,"TM 189",null,null,null,189,112,105,"TM 112","-","TM 105",3,":",0,null,189,"FC Bayern München",13,3,2,8,18,":",33,-15,11,"","FC Bayern München","","","","","","","","","","","","","","","","","","","","","","","","","4 : 0","","","","","","","","","","0 : 1","1 : 3","","2 : 9","","","","","","","","","","0 : 3","","","","","","0 : 0","","","","","","","","","","","","","3 : 0","","","","","0 : 2","","","","","","","0 : 1","","","2 : 5","","","","","","","","","","2 : 9","","","","","","","","","","","","","","","","","","","","","","","4 : 0","","","","","0 : 0","","","","","","","","","","","","","","","","","","","","","","","","","","","","","","","","","","","","","","","","","","","","","","","","","","","","","","","","","","","","","","","","","","","","","","","","","","","","","","","","","","","","",""]
[null,190,"TM 190",null,null,null,190,136,13,"TM 136","-","Juventus Turin",2,":",9,null,190,"TM 98",13,3,2,8,18,":",34,-16,11,"","TM 98","","","","","","","","","","1 : 2","","","","","","2 : 5","","","","","","3 : 0","","","","3 : 1","","","","","","","","","","","","","","","","","","","","","0 : 1","","1 : 5","","2 : 9","","","","","","","","","","","","","0 : 0","","","","2 : 5","","","","","0 : 3","","","","","","","","","","","","","","","","1 : 3","3 : 0","","","","","","","","","","","","","","","","","","","","","","","","","","","","","","","","","","","","","","","","","","","","","","","","","","","","0 : 0","","","","","","","","","","","","","","","","","","","","","","","","","","","","","","","","","","","","","","","","","","","","","","","","","","","","","","","","","","","","","","",""]
[null,191,"TM 191",null,null,null,191,111,198,"TM 111","-","TM 198",1,":",3,null,191,"Young Boys Bern",13,3,2,8,12,":",28,-16,11,"","Young Boys Bern","","","","","","","2 : 9","","0 : 2","","","1 : 3","","","","","","","3 : 1","","0 : 0","","0 : 3","","","","","0 : 3","","","","","","","","","","","","","3 : 1","","","","","","","","","","","","0 : 0","","0 : 2","","","","","","","","","","","0 : 3","","","0 : 1","","","","","3 : 0","","","","","","","","","","","","","","","","","","","","","","","","","","","","","","","","","","","","","","","","","","","","","","","","","","","","","","","","","","","","","","","","","","","","","","","","","","","","","","","","","","","","","","","","","","","","","","","","","","","","","","","","","","","","","","","","","","","","","","","","","","","","","","","","","","",""]
[null,192,"TM 192",null,null,null,192,15,52,"FC Arsenal","-","TM 52",3,":",1,null,192,"Real Madrid",12,3,1,8,19,":",40,-21,10,"","Real Madrid","","","","","","","","","","","2 : 5","","","","","","","2 : 9","","0 : 3","","","","","","","","","","","","","","","","","","","","","","","","","1 : 5","2 : 9","","","","","","","","","","3 : 0","","","","","","","","","","","","","","","","","","","","","","","","","1 : 3","","","","0 : 0","","","","","","","","","","","","","3 : 1","","","","","","","1 : 3","","0 : 2","","","","","","","","","","","","","","","","","","","","","","","","","","","","","","","","","","","","","","","","","","","","","","","","","","","","","","","","","","","","","","","","","","","","","","","","","","","","","","","","","","","","","","","","","","","","","","","","","",""]
[null,193,"TM 193",null,null,null,193,53,131,"TM 53","-","TM 131",0,":",2,null,193,"TM 171",13,3,1,9,16,":",38,-22,10,"","TM 171","","","","","","0 : 2","","3 : 0","","","","","","0 : 0","1 : 3","","2 : 9","","","","","","","3 : 0","","","","","0 : 3","","0 : 7","","","","","","","","0 : 1","4 : 0","","","","2 : 5","","","","","","","","","","","","","","","","","","","","","1 : 5","","","","","","","","","","","","","","","","","","","","","","","","","","","","","","","","","","0 : 3","","","","","","","","","","","","","","","","","","","","","","","","","","","","","","","","","","","","","","","","","","","","","","","","","","","","","","","","","","","","","","","","","","","","","","","","","","","","","","","","","","","","","","","","","","","","","","","","","","","","","","","","","",""]
[null,194,"TM 194",null,null,null,194,60,197,{"$f":"IFERROR(VLOOKUP($H199,$B$6:$C$205,2,0),\"\")","v":"TM 60"},"-",{"$f":"IFERROR(VLOOKUP($I199,$B$6:$C$205,2,0),\"\")","v":"TM 197"},0,":",0,null,194,"TM 180",13,3,1,9,18,":",41,-23,10,"","TM 180","","","","","","","","","","0 : 1","","","","","","2 : 9","","","","","","2 : 5","","","","","0 : 3","","","","","","","","","","","","","","","","","","","","","","","","","","","","","","","","1 : 5","","","","1 : 3","3 : 1","","","","","","","","","3 : 0","","","","","","","","","","","","","","","","0 : 0","","","","","","","","","","","3 : 0","","","","","","","","","","","","","","0 : 6","","","","","2 : 5","","","","1 : 3","","","","","","","","","","","","","","","","","","","","","","","","","","","","","","","","","","","","","","","","","","","","","","","","","","","","","","","","","","","","","","","","","","","","","","","","","","","","","","","","","",""]
[null,195,"TM 195",null,null,null,195,130,62,"TM 130","-","TM 62",0,":",3,null,195,"TM 158",13,2,3,8,18,":",35,-17,9,"","TM 158","","","","","","","","","","","","","","","","","","","","","","","","","3 : 0","","","","","","","","","","0 : 3","0 : 0","","1 : 5","","","","","","","","","","2 : 5","","","","","","1 : 2","","","","","","","","","","","","","2 : 2","","","","","1 : 3","","","","","","","","0 : 1","","","","","","","","","","","","","","2 : 5","2 : 9","","","","","","","","","","","","","","","","","","","","","0 : 0","","","","","","","","","","","","","","","","","","","","","","","","","","","","","","","","","","","","","","","","","","","","","","","","","","","","","","","","","","","","","","","","","","","","","","","","","","","","","","","","","","","","","","","","",""]
[null,196,"TM 196",null,null,null,196,55,189,"TM 55","-","TM 189",0,":",1,null,196,"TM 111",12,2,2,8,11,":",25,-14,8,"","TM 111","","","","","","","","","","","","","","","","","","1 : 5","","3 : 0","","","","","","","","","","","","","0 : 3","","","","","","","","","","","","3 : 4","0 : 2","","","","","","","","","","3 : 1","","","","","","","","","","","","","","0 : 3","","","","","","","","","","","1 : 3","","","","0 : 1","","","","","","","","","","","","","","","","","","0 : 3","","0 : 0","","0 : 0","","","","","","","","","","","","","","","","","","","","","","","","","","","","","","","","","","","","","","","","","","","","","","","","","","","","","","","","","","","","","","","","","","","","","","","","","","","","","","","","","","","","","","","","","","","","","","","","","",""]
[null,197,"TM 197",null,null,null,197,92,122,"TM 92","-","TM 122",0,":",1,null,197,"TM 172",13,2,2,9,17,":",36,-19,8,"","TM 172","","","","","","","","","","","","","","","","","","","","","","","","","2 : 5","","","","","","","","","","","4 : 0","","","","","","","","","","","","2 : 9","","","","","","0 : 1","","","","","","","","","","","","","1 : 5","","","","","0 : 0","","","","","","","","","","1 : 3","","","","","","","","","","1 : 3","","","","","1 : 2","","","","","","","","","","","","","","","","","","2 : 5","","","","","0 : 3","","","","","","","","","","","","","","","","","","","0 : 0","","","","","","","","","","","","","","","","","","","","","","","","","","","","","","","","","","","","","","","","","","","","","","","","","","","","","","","","","","","","","","","","","",""]
[null,198,"TM 198",null,null,null,198,100,59,"TM 100","-","TM 59",3,":",0,null,198,"TM 60",12,2,2,8,15,":",35,-20,8,"","TM 60","","","","","","","","","","","","","","","","","","","","","","","","","","","","","","1 : 5","","2 : 9","1 : 3","0 : 3","","","","","","","","","","","","","","","","","","3 : 1","","","","","","0 : 1","","","","","","","","","","","","0 : 0","","","","","","","","","","","","","","2 : 5","","","0 : 0","","","","","","","","","1 : 3","","","","","","","3 : 0","","2 : 5","","","","","","","","","","","","","","","","","","","","","","","","","","","","","","","","","","","","","","","","","","","","","","","","","","","","","","","","","","","","","","","","","","","","","","","","","","","","","","","","","","","","","","","","","","","","","","","","","","","",""]
[null,199,"TM 199",null,null,null,199,125,164,"TM 125","-","TM 164",1,":",5,null,199,"TM 106",13,2,2,9,15,":",36,-21,8,"","TM 106","","","","","","","","","","1 : 3","","","","","","0 : 3","","","","","","4 : 0","","","","0 : 0","0 : 0","","","","","","","","","","","","","","","","","","","","","","2 : 9","","","","","","","","","","3 : 0","","","","2 : 9","1 : 3","","","","","","","","","0 : 1","","","","","","","","","","","","","","","","0 : 2","","","","","","","","","","","0 : 1","","","","","","","","","","","","","","","","","","","","","","","2 : 5","","","","","","","","","","","","","","","","","","","","","","","","","","","","","","","","","","","","","","","","","","","","","","","","","","","","","","","","","","","","","","","","","","","","","","","","","","","","","","","","","",""]
[null,200,"TM 200",null,null,null,200,54,76,"TM 54","-","TM 76",4,":",0,null,200,"TM 136",12,2,1,9,15,":",35,-20,7,"","TM 136","","","","","","","","","","","","","","","","","","","","","","","","","","","","","","3 : 0","","0 : 3","2 : 9","0 : 0","","","","","","","","","","","","","","","","","","1 : 2","","","","","","1 : 3","","","","","","","","","","","","","","","","","","","0 : 1","","","","","","","4 : 0","","","0 : 2","","","","2 : 9","","","","","2 : 5","","","","","","","0 : 1","","","","","","","","","","","","","","","","","","","","","","","","","","","","","","","","","","","","","","","","","","","","","","","","","","","","","","","","","","","","","","","","","","","","","","","","","","","","","","","","","","","","","","","","","","","","","","","","","","","","","",""]
[null,null,null,null,null,null,201,137,32,"TM 137","-","VfB Stuttgart",2,":",5]
[null,null,null,null,null,null,202,31,33,"FC Girona","-","Sturm Graz",3,":",1]
[null,null,null,null,null,null,203,35,23,"Eintracht Frankfurt","-","Dinamo Zagreb",0,":",3]
[null,null,null,null,null,null,204,21,161,"PSV Eindhoven","-","TM 161",9,":",2]
[null,null,null,null,null,null,205,138,18,"TM 138","-","AC Mailand",3,":",1]
[null,null,null,null,null,null,206,17,146,"Schachtjor Donezk","-","TM 146",1,":",3]
[null,null,null,null,null,null,207,47,117,"TM 47","-","TM 117",2,":",0]
[null,null,null,null,null,null,208,191,153,"TM 191","-","TM 153",0,":",0]
[null,null,null,null,null,null,209,42,190,"TM 42","-","TM 190",3,":",0]
[null,null,null,null,null,null,210,188,43,"TM 188","-","TM 43",0,":",0]
[null,null,null,null,null,null,211,177,116,"TM 177","-","TM 116",1,":",0]
[null,null,null,null,null,null,212,115,150,"TM 115","-","TM 150",0,":",3]
[null,null,null,null,null,null,213,140,20,"TM 140","-","Sporting Lissabon",5,":",1]
[null,null,null,null,null,null,214,109,126,"TM 109","-","TM 126",0,":",4]
[null,null,null,null,null,null,215,38,107,"FC Basel","-","TM 107",5,":",2]
[null,null,null,null,null,null,216,12,78,"Atalanta Bergamo","-","TM 78",3,":",5]
[null,null,null,null,null,null,217,71,187,"TM 71","-","TM 187",0,":",3]
[null,null,null,null,null,null,218,186,45,"TM 186","-","TM 45",9,":",2]
[null,null,null,null,null,null,219,199,98,"TM 199","-","TM 98",2,":",1]
[null,null,null,null,null,null,220,185,95,"TM 185","-","TM 95",1,":",3]
[null,null,null,null,null,null,221,166,97,"TM 166","-","TM 97",2,":",0]
[null,null,null,null,null,null,222,120,165,"TM 120","-","TM 165",0,":",0]
[null,null,null,null,null,null,223,73,11,"TM 73","-","Atletico Madrid",3,":",0]
[null,null,null,null,null,null,224,184,27,"TM 184","-","Young Boys Bern",0,":",0]
[null,null,null,null,null,null,225,168,93,"TM 168","-","TM 93",1,":",0]
[null,null,null,null,null,null,226,94,24,"TM 94","-","Red Bull Salzburg",0,":",3]
[null,null,null,null,null,null,227,157,30,"TM 157","-","FC Bologna",5,":",1]
[null,null,null,null,null,null,228,160,39,"TM 160","-","FC Lille",0,":",4]
[null,null,null,null,null,null,229,192,106,"TM 192","-","TM 106",5,":",2]
[null,null,null,null,null,null,230,159,34,"TM 159","-","Stade Brest",3,":",1]
[null,null,null,null,null,null,231,129,148,"TM 129","-","TM 148",0,":",3]
[null,null,null,null,null,null,232,183,162,"TM 183","-","TM 162",2,":",2]
[null,null,null,null,null,null,233,147,180,"TM 147","-","TM 180",3,":",1]
[null,null,null,null,null,null,234,8,36,"RB Leipzig","-","Mainz 05",1,":",3]
[null,null,null,null,null,null,235,182,110,"TM 182","-","TM 110",2,":",0]
[null,null,null,null,null,null,236,89,84,"TM 89","-","TM 84",0,":",0]
[null,null,null,null,null,null,237,194,7,"TM 194","-","Borussia Dortmund",6,":",0]
[null,null,null,null,null,null,238,87,99,"TM 87","-","TM 99",0,":",0]
[null,null,null,null,null,null,239,16,176,"FC Brügge","-","TM 176",1,":",0]
[null,null,null,null,null,null,240,91,163,"TM 91","-","TM 163",5,":",2]
[null,null,null,null,null,null,241,74,86,"TM 74","-","TM 86",1,":",1]
[null,null,null,null,null,null,242,85,178,"TM 85","-","TM 178",0,":",4]
[null,null,null,null,null,null,243,81,83,"TM 81","-","TM 83",5,":",2]
[null,null,null,null,null,null,244,175,108,"TM 175","-","TM 108",1,":",3]
[null,null,null,null,null,null,245,57,174,"TM 57","-","TM 174",3,":",1]
[null,null,null,null,null,null,246,10,14,"Bayer Leverkusen","-","Benfica Lissabon",0,":",2]
[null,null,null,null,null,null,247,68,19,"TM 68","-","Feyenoord Rotterdam",0,":",0]
[null,null,null,null,null,null,248,77,118,"TM 77","-","TM 118",0,":",3]
[null,null,null,null,null,null,249,171,6,"TM 171","-","Inter Mailand",0,":",7]
[null,null,null,null,null,null,250,104,88,"TM 104","-","TM 88",0,":",1]
[null,null,null,null,null,null,251,44,134,"TM 44","-","TM 134",3,":",0]
[null,null,null,null,null,null,252,145,48,"TM 145","-","TM 48",1,":",5]
[null,null,null,null,null,null,253,63,75,"TM 63","-","TM 75",4,":",0]
[null,null,null,null,null,null,254,158,25,"TM 158","-","OSC Lille",2,":",5]
[null,null,null,null,null,null,255,49,132,"TM 49","-","TM 132",1,":",3]
[null,null,null,null,null,null,256,4,40,"Paris Saint-Germain","-","Hertha BSC",3,":",0]
[null,null,null,null,null,null,257,113,29,"TM 113","-","Aston Villa",2,":",9]
[null,null,null,null,null,null,258,72,46,{"$f":"IFERROR(VLOOKUP($H263,$B$6:$C$205,2,0),\"\")","v":"TM 72"},"-",{"$f":"IFERROR(VLOOKUP($I263,$B$6:$C$205,2,0),\"\")","v":"TM 46"},1,":",3]
[null,null,null,null,null,null,259,133,144,"TM 133","-","TM 144",3,":",1]
[null,null,null,null,null,null,260,156,5,"TM 156","-","FC Liverpool",0,":",2]
[null,null,null,null,null,null,261,2,173,"Manchester City","-","TM 173",0,":",0]
[null,null,null,null,null,null,262,102,66,"TM 102","-","TM 66",0,":",3]
[null,null,null,null,null,null,263,51,181,"TM 51","-","TM 181",0,":",0]
[null,null,null,null,null,null,264,3,151,"FC Bayern München","-","TM 151",0,":",1]
[null,null,null,null,null,null,265,127,142,"TM 127","-","TM 142",3,":",0]
[null,null,null,null,null,null,266,103,64,"TM 103","-","TM 64",1,":",5]
[null,null,null,null,null,null,267,195,70,"TM 195","-","TM 70",4,":",0]
[null,null,null,null,null,null,268,172,154,"TM 172","-","TM 154",2,":",5]
[null,null,null,null,null,null,269,65,155,"TM 65","-","TM 155",3,":",1]
[null,null,null,null,null,null,270,69,67,"TM 69","-","TM 67",0,":",3]
[null,null,null,null,null,null,271,196,28,"TM 196","-","AS Monaco",9,":",2]
[null,null,null,null,null,null,272,170,193,"TM 170","-","TM 193",3,":",1]
[null,null,null,null,null,null,273,90,152,"TM 90","-","TM 152",1,":",3]
[null,null,null,null,null,null,274,141,9,"TM 141","-","FC Barcelona",2,":",0]
[null,null,null,null,null,null,275,149,167,"TM 149","-","TM 167",0,":",0]
[null,null,null,null,null,null,276,61,26,"TM 61","-","Roter Stern Belgrad",3,":",0]
[null,null,null,null,null,null,277,143,114,"TM 143","-","TM 114",0,":",0]
[null,null,null,null,null,null,278,80,41,"TM 80","-","TM 41",1,":",0]
[null,null,null,null,null,null,279,128,135,"TM 128","-","TM 135",0,":",3]
[null,null,null,null,null,null,280,37,119,"AC Roma","-","TM 119",5,":",1]
[null,null,null,null,null,null,281,50,169,"TM 50","-","TM 169",0,":",4]
[null,null,null,null,null,null,282,82,79,"TM 82","-","TM 79",5,":",2]
[null,null,null,null,null,null,283,96,101,"TM 96","-","TM 101",3,":",1]
[null,null,null,null,null,null,284,123,22,"TM 123","-","Celtic Glasgow",0,":",3]
[null,null,null,null,null,null,285,139,179,"TM 139","-","TM 179",9,":",2]
[null,null,null,null,null,null,286,56,200,"TM 56","-","TM 200",2,":",1]
[null,null,null,null,null,null,287,124,121,"TM 124","-","TM 121",1,":",3]
[null,null,null,null,null,null,288,105,1,"TM 105","-","Real Madrid",2,":",0]
[null,null,null,null,null,null,289,58,136,"TM 58","-","TM 136",0,":",0]
[null,null,null,null,null,null,290,198,112,"TM 198","-","TM 112",3,":",0]
[null,null,null,null,null,null,291,13,15,"Juventus Turin","-","FC Arsenal",0,":",0]
[null,null,null,null,null,null,292,131,111,"TM 131","-","TM 111",1,":",0]
[null,null,null,null,null,null,293,52,60,"TM 52","-","TM 60",0,":",3]
[null,null,null,null,null,null,294,62,53,"TM 62","-","TM 53",5,":",1]
[null,null,null,null,null,null,295,197,55,"TM 197","-","TM 55",0,":",4]
[null,null,null,null,null,null,296,122,130,"TM 122","-","TM 130",5,":",2]
[null,null,null,null,null,null,297,189,100,"TM 189","-","TM 100",3,":",1]
[null,null,null,null,null,null,298,164,92,"TM 164","-","TM 92",0,":",3]
[null,null,null,null,null,null,299,59,54,"TM 59","-","TM 54",9,":",2]
[null,null,null,null,null,null,300,76,125,"TM 76","-","TM 125",3,":",1]
[null,null,null,null,null,null,301,31,137,"FC Girona","-","TM 137",1,":",3]
[null,null,null,null,null,null,302,23,32,"Dinamo Zagreb","-","VfB Stuttgart",2,":",0]
[null,null,null,null,null,null,303,33,21,"Sturm Graz","-","PSV Eindhoven",0,":",0]
[null,null,null,null,null,null,304,18,35,"AC Mailand","-","Eintracht Frankfurt",3,":",0]
[null,null,null,null,null,null,305,161,17,"TM 161","-","Schachtjor Donezk",0,":",0]
[null,null,null,null,null,null,306,117,138,"TM 117","-","TM 138",1,":",0]
[null,null,null,null,null,null,307,146,191,"TM 146","-","TM 191",0,":",3]
[null,null,null,null,null,null,308,190,47,"TM 190","-","TM 47",5,":",1]
[null,null,null,null,null,null,309,153,188,"TM 153","-","TM 188",0,":",4]
[null,null,null,null,null,null,310,116,42,"TM 116","-","TM 42",5,":",2]
[null,null,null,null,null,null,311,43,115,"TM 43","-","TM 115",1,":",3]
[null,null,null,null,null,null,312,20,177,"Sporting Lissabon","-","TM 177",3,":",1]
[null,null,null,null,null,null,313,150,109,"TM 150","-","TM 109",0,":",2]
[null,null,null,null,null,null,314,107,140,"TM 107","-","TM 140",0,":",0]
[null,null,null,null,null,null,315,126,12,"TM 126","-","Atalanta Bergamo",0,":",3]
[null,null,null,null,null,null,316,187,38,"TM 187","-","FC Basel",0,":",0]
[null,null,null,null,null,null,317,78,186,"TM 78","-","TM 186",0,":",1]
[null,null,null,null,null,null,318,98,71,"TM 98","-","TM 71",3,":",0]
[null,null,null,null,null,null,319,45,185,"TM 45","-","TM 185",1,":",5]
[null,null,null,null,null,null,320,97,199,"TM 97","-","TM 199",4,":",0]
[null,null,null,null,null,null,321,95,120,"TM 95","-","TM 120",2,":",5]
[null,null,null,null,null,null,322,11,166,{"$f":"IFERROR(VLOOKUP($H327,$B$6:$C$205,2,0),\"\")","v":"Atletico Madrid"},"-",{"$f":"IFERROR(VLOOKUP($I327,$B$6:$C$205,2,0),\"\")","v":"TM 166"},1,":",3]
[null,null,null,null,null,null,323,165,184,"TM 165","-","TM 184",3,":",0]
[null,null,null,null,null,null,324,93,73,"TM 93","-","TM 73",2,":",9]
[null,null,null,null,null,null,325,27,94,"Young Boys Bern","-","TM 94",1,":",3]
[null,null,null,null,null,null,326,30,168,"FC Bologna","-","TM 168",3,":",1]
[null,null,null,null,null,null,327,24,160,"Red Bull Salzburg","-","TM 160",0,":",2]
[null,null,null,null,null,null,328,106,157,"TM 106","-","TM 157",0,":",0]
[null,null,null,null,null,null,329,39,159,"FC Lille","-","TM 159",0,":",3]
[null,null,null,null,null,null,330,148,192,"TM 148","-","TM 192",0,":",0]
[null,null,null,null,null,null,331,34,183,"Stade Brest","-","TM 183",0,":",1]
[null,null,null,null,null,null,332,180,129,"TM 180","-","TM 129",3,":",0]
[null,null,null,null,null,null,333,162,8,"TM 162","-","RB Leipzig",1,":",5]
[null,null,null,null,null,null,334,110,147,"TM 110","-","TM 147",4,":",0]
[null,null,null,null,null,null,335,36,89,"Mainz 05","-","TM 89",2,":",5]
[null,null,null,null,null,null,336,7,182,"Borussia Dortmund","-","TM 182",3,":",1]
[null,null,null,null,null,null,337,84,87,"TM 84","-","TM 87",0,":",3]
[null,null,null,null,null,null,338,176,194,"TM 176","-","TM 194",9,":",2]
[null,null,null,null,null,null,339,99,91,"TM 99","-","TM 91",3,":",1]
[null,null,null,null,null,null,340,86,16,"TM 86","-","FC Brügge",1,":",3]
[null,null,null,null,null,null,341,163,85,"TM 163","-","TM 85",2,":",0]
[null,null,null,null,null,null,342,83,74,"TM 83","-","TM 74",0,":",0]
[null,null,null,null,null,null,343,178,175,"TM 178","-","TM 175",3,":",0]
[null,null,null,null,null,null,344,174,81,"TM 174","-","TM 81",0,":",0]
[null,null,null,null,null,null,345,108,10,"TM 108","-","Bayer Leverkusen",1,":",0]
[null,null,null,null,null,null,346,19,57,"Feyenoord Rotterdam","-","TM 57",0,":",3]
[null,null,null,null,null,null,347,14,77,"Benfica Lissabon","-","TM 77",5,":",1]
[null,null,null,null,null,null,348,6,68,"Inter Mailand","-","TM 68",0,":",4]
[null,null,null,null,null,null,349,118,104,"TM 118","-","TM 104",5,":",2]
[null,null,null,null,null,null,350,134,171,"TM 134","-","TM 171",3,":",1]
[null,null,null,null,null,null,351,88,145,"TM 88","-","TM 145",0,":",3]
[null,null,null,null,null,null,352,75,44,"TM 75","-","TM 44",9,":",2]
[null,null,null,null,null,null,353,48,158,"TM 48","-","TM 158",2,":",1]
[null,null,null,null,null,null,354,132,63,"TM 132","-","TM 63",1,":",3]
[null,null,null,null,null,null,355,25,4,"OSC Lille","-","Paris Saint-Germain",2,":",0]
[null,null,null,null,null,null,356,29,49,"Aston Villa","-","TM 49",0,":",0]
[null,null,null,null,null,null,357,40,72,"Hertha BSC","-","TM 72",3,":",0]
[null,null,null,null,null,null,358,144,113,"TM 144","-","TM 113",0,":",0]
[null,null,null,null,null,null,359,46,156,"TM 46","-","TM 156",1,":",0]
[null,null,null,null,null,null,360,173,133,"TM 173","-","TM 133",0,":",3]
[null,null,null,null,null,null,361,5,102,"FC Liverpool","-","TM 102",5,":",1]
[null,null,null,null,null,null,362,181,2,"TM 181","-","Manchester City",0,":",4]
[null,null,null,null,null,null,363,66,3,"TM 66","-","FC Bayern München",5,":",2]
[null,null,null,null,null,null,364,142,51,"TM 142","-","TM 51",3,":",1]
[null,null,null,null,null,null,365,151,103,"TM 151","-","TM 103",0,":",3]
[null,null,null,null,null,null,366,70,127,"TM 70","-","TM 127",9,":",2]
[null,null,null,null,null,null,367,64,172,"TM 64","-","TM 172",3,":",1]
[null,null,null,null,null,null,368,155,195,"TM 155","-","TM 195",1,":",3]
[null,null,null,null,null,null,369,154,69,"TM 154","-","TM 69",2,":",0]
[null,null,null,null,null,null,370,28,65,"AS Monaco","-","TM 65",0,":",0]
[null,null,null,null,null,null,371,67,170,"TM 67","-","TM 170",3,":",0]
[null,null,null,null,null,null,372,152,196,"TM 152","-","TM 196",0,":",0]
[null,null,null,null,null,null,373,193,141,"TM 193","-","TM 141",1,":",0]
[null,null,null,null,null,null,374,167,90,"TM 167","-","TM 90",0,":",3]
[null,null,null,null,null,null,375,9,61,"FC Barcelona","-","TM 61",5,":",1]
[null,null,null,null,null,null,376,114,149,"TM 114","-","TM 149",0,":",4]
[null,null,null,null,null,null,377,26,80,"Roter Stern Belgrad","-","TM 80",5,":",2]
[null,null,null,null,null,null,378,135,143,"TM 135","-","TM 143",1,":",3]
[null,null,null,null,null,null,379,41,37,"TM 41","-","AC Roma",3,":",1]
[null,null,null,null,null,null,380,169,128,"TM 169","-","TM 128",0,":",2]
[null,null,null,null,null,null,381,119,82,"TM 119","-","TM 82",0,":",0]
[null,null,null,null,null,null,382,101,50,"TM 101","-","TM 50",0,":",3]
[null,null,null,null,null,null,383,79,123,"TM 79","-","TM 123",0,":",0]
[null,null,null,null,null,null,384,179,96,"TM 179","-","TM 96",0,":",1]
[null,null,null,null,null,null,385,22,56,"Celtic Glasgow","-","TM 56",3,":",0]
[null,null,null,null,null,null,386,121,139,{"$f":"IFERROR(VLOOKUP($H391,$B$6:$C$205,2,0),\"\")","v":"TM 121"},"-",{"$f":"IFERROR(VLOOKUP($I391,$B$6:$C$205,2,0),\"\")","v":"TM 139"},1,":",5]
[null,null,null,null,null,null,387,200,105,"TM 200","-","TM 105",4,":",0]
[null,null,null,null,null,null,388,136,124,"TM 136","-","TM 124",2,":",5]
[null,null,null,null,null,null,389,1,198,"Real Madrid","-","TM 198",1,":",3]
[null,null,null,null,null,null,390,15,58,"FC Arsenal","-","TM 58",3,":",0]
[null,null,null,null,null,null,391,112,131,"TM 112","-","TM 131",2,":",9]
[null,null,null,null,null,null,392,60,13,"TM 60","-","Juventus Turin",1,":",3]
[null,null,null,null,null,null,393,111,62,"TM 111","-","TM 62",3,":",1]
[null,null,null,null,null,null,394,55,52,"TM 55","-","TM 52",0,":",2]
[null,null,null,null,null,null,395,53,122,"TM 53","-","TM 122",0,":",0]
[null,null,null,null,null,null,396,100,197,"TM 100","-","TM 197",0,":",3]
[null,null,null,null,null,null,397,130,164,"TM 130","-","TM 164",0,":",0]
[null,null,null,null,null,null,398,54,189,"TM 54","-","TM 189",0,":",1]
[null,null,null,null,null,null,399,92,76,"TM 92","-","TM 76",3,":",0]
[null,null,null,null,null,null,400,125,59,"TM 125","-","TM 59",1,":",5]
[null,null,null,null,null,null,401,137,23,"TM 137","-","Dinamo Zagreb",4,":",0]
[null,null,null,null,null,null,402,21,31,"PSV Eindhoven","-","FC Girona",2,":",5]
[null,null,null,null,null,null,403,32,18,"VfB Stuttgart","-","AC Mailand",3,":",1]
[null,null,null,null,null,null,404,17,33,"Schachtjor Donezk","-","Sturm Graz",0,":",3]
[null,null,null,null,null,null,405,35,117,"Eintracht Frankfurt","-","TM 117",9,":",2]
[null,null,null,null,null,null,406,191,161,"TM 191","-","TM 161",3,":",1]
[null,null,null,null,null,null,407,138,190,"TM 138","-","TM 190",1,":",3]
[null,null,null,null,null,null,408,188,146,"TM 188","-","TM 146",2,":",0]
[null,null,null,null,null,null,409,47,116,"TM 47","-","TM 116",0,":",0]
[null,null,null,null,null,null,410,115,153,"TM 115","-","TM 153",3,":",0]
[null,null,null,null,null,null,411,42,20,"TM 42","-","Sporting Lissabon",0,":",0]
[null,null,null,null,null,null,412,109,43,"TM 109","-","TM 43",1,":",0]
[null,null,null,null,null,null,413,177,107,"TM 177","-","TM 107",0,":",3]
[null,null,null,null,null,null,414,12,150,"Atalanta Bergamo","-","TM 150",5,":",1]
[null,null,null,null,null,null,415,140,187,"TM 140","-","TM 187",0,":",4]
[null,null,null,null,null,null,416,186,126,"TM 186","-","TM 126",5,":",2]
[null,null,null,null,null,null,417,38,98,"FC Basel","-","TM 98",3,":",1]
[null,null,null,null,null,null,418,185,78,"TM 185","-","TM 78",0,":",3]
[null,null,null,null,null,null,419,71,97,"TM 71","-","TM 97",9,":",2]
[null,null,null,null,null,null,420,120,45,"TM 120","-","TM 45",2,":",1]
[null,null,null,null,null,null,421,199,11,"TM 199","-","Atletico Madrid",1,":",3]
[null,null,null,null,null,null,422,184,95,"TM 184","-","TM 95",2,":",0]
[null,null,null,null,null,null,423,166,93,"TM 166","-","TM 93",0,":",0]
[null,null,null,null,null,null,424,94,165,"TM 94","-","TM 165",3,":",0]
[null,null,null,null,null,null,425,73,30,"TM 73","-","FC Bologna",0,":",0]
[null,null,null,null,null,null,426,160,27,"TM 160","-","Young Boys Bern",1,":",0]
[null,null,null,null,null,null,427,168,106,"TM 168","-","TM 106",0,":",3]
[null,null,null,null,null,null,428,159,24,"TM 159","-","Red Bull Salzburg",5,":",1]
[null,null,null,null,null,null,429,157,148,"TM 157","-","TM 148",0,":",4]
[null,null,null,null,null,null,430,183,39,"TM 183","-","FC Lille",5,":",2]
[null,null,null,null,null,null,431,192,180,"TM 192","-","TM 180",3,":",1]
[null,null,null,null,null,null,432,8,34,"RB Leipzig","-","Stade Brest",0,":",3]
[null,null,null,null,null,null,433,129,110,"TM 129","-","TM 110",9,":",2]
[null,null,null,null,null,null,434,89,162,"TM 89","-","TM 162",3,":",1]
[null,null,null,null,null,null,435,147,7,"TM 147","-","Borussia Dortmund",1,":",3]
[null,null,null,null,null,null,436,87,36,"TM 87","-","Mainz 05",2,":",0]
[null,null,null,null,null,null,437,182,176,"TM 182","-","TM 176",0,":",0]
[null,null,null,null,null,null,438,91,84,"TM 91","-","TM 84",3,":",0]
[null,null,null,null,null,null,439,194,86,"TM 194","-","TM 86",0,":",0]
[null,null,null,null,null,null,440,85,99,"TM 85","-","TM 99",1,":",0]
[null,null,null,null,null,null,441,16,83,"FC Brügge","-","TM 83",0,":",3]
[null,null,null,null,null,null,442,175,163,"TM 175","-","TM 163",5,":",1]
[null,null,null,null,null,null,443,74,174,"TM 74","-","TM 174",0,":",4]
[null,null,null,null,null,null,444,10,178,"Bayer Leverkusen","-","TM 178",5,":",2]
[null,null,null,null,null,null,445,81,19,"TM 81","-","Feyenoord Rotterdam",1,":",3]
[null,null,null,null,null,null,446,77,108,"TM 77","-","TM 108",3,":",1]
[null,null,null,null,null,null,447,57,6,"TM 57","-","Inter Mailand",0,":",2]
[null,null,null,null,null,null,448,104,14,"TM 104","-","Benfica Lissabon",0,":",0]
[null,null,null,null,null,null,449,68,134,"TM 68","-","TM 134",0,":",3]
[null,null,null,null,null,null,450,145,118,{"$f":"IFERROR(VLOOKUP($H455,$B$6:$C$205,2,0),\"\")","v":"TM 145"},"-",{"$f":"IFERROR(VLOOKUP($I455,$B$6:$C$205,2,0),\"\")","v":"TM 118"},0,":",0]
[null,null,null,null,null,null,451,171,75,"TM 171","-","TM 75",0,":",1]
[null,null,null,null,null,null,452,158,88,"TM 158","-","TM 88",3,":",0]
[null,null,null,null,null,null,453,44,132,"TM 44","-","TM 132",1,":",5]
[null,null,null,null,null,null,454,4,48,"Paris Saint-Germain","-","TM 48",4,":",0]
[null,null,null,null,null,null,455,63,29,"TM 63","-","Aston Villa",2,":",5]
[null,null,null,null,null,null,456,72,25,"TM 72","-","OSC Lille",1,":",3]
[null,null,null,null,null,null,457,49,144,"TM 49","-","TM 144",3,":",0]
[null,null,null,null,null,null,458,156,40,"TM 156","-","Hertha BSC",2,":",9]
[null,null,null,null,null,null,459,113,173,"TM 113","-","TM 173",1,":",3]
[null,null,null,null,null,null,460,102,46,"TM 102","-","TM 46",3,":",1]
[null,null,null,null,null,null,461,133,181,"TM 133","-","TM 181",0,":",2]
[null,null,null,null,null,null,462,3,5,"FC Bayern München","-","FC Liverpool",0,":",0]
[null,null,null,null,null,null,463,2,142,"Manchester City","-","TM 142",0,":",3]
[null,null,null,null,null,null,464,103,66,"TM 103","-","TM 66",0,":",0]
[null,null,null,null,null,null,465,51,70,"TM 51","-","TM 70",0,":",1]
[null,null,null,null,null,null,466,172,151,"TM 172","-","TM 151",3,":",0]
[null,null,null,null,null,null,467,127,155,"TM 127","-","TM 155",1,":",5]
[null,null,null,null,null,null,468,69,64,"TM 69","-","TM 64",4,":",0]
[null,null,null,null,null,null,469,195,28,"TM 195","-","AS Monaco",2,":",5]
[null,null,null,null,null,null,470,170,154,"TM 170","-","TM 154",3,":",1]
[null,null,null,null,null,null,471,65,152,"TM 65","-","TM 152",0,":",3]
[null,null,null,null,null,null,472,141,67,"TM 141","-","TM 67",9,":",2]
[null,null,null,null,null,null,473,196,167,"TM 196","-","TM 167",3,":",1]
[null,null,null,null,null,null,474,61,193,"TM 61","-","TM 193",1,":",3]
[null,null,null,null,null,null,475,90,114,"TM 90","-","TM 114",2,":",0]
[null,null,null,null,null,null,476,80,9,"TM 80","-","FC Barcelona",0,":",0]
[null,null,null,null,null,null,477,149,135,"TM 149","-","TM 135",3,":",0]
[null,null,null,null,null,null,478,37,26,"AC Roma","-","Roter Stern Belgrad",0,":",0]
[null,null,null,null,null,null,479,143,169,"TM 143","-","TM 169",1,":",0]
[null,null,null,null,null,null,480,82,41,"TM 82","-","TM 41",0,":",3]
[null,null,null,null,null,null,481,128,101,"TM 128","-","TM 101",5,":",1]
[null,null,null,null,null,null,482,123,119,"TM 123","-","TM 119",0,":",4]
[null,null,null,null,null,null,483,50,179,"TM 50","-","TM 179",5,":",2]
[null,null,null,null,null,null,484,56,79,"TM 56","-","TM 79",3,":",1]
[null,null,null,null,null,null,485,96,121,"TM 96","-","TM 121",0,":",3]
[null,null,null,null,null,null,486,105,22,"TM 105","-","Celtic Glasgow",9,":",2]
[null,null,null,null,null,null,487,139,136,"TM 139","-","TM 136",2,":",1]
[null,null,null,null,null,null,488,198,200,"TM 198","-","TM 200",1,":",3]
[null,null,null,null,null,null,489,124,15,"TM 124","-","FC Arsenal",2,":",0]
[null,null,null,null,null,null,490,131,1,"TM 131","-","Real Madrid",0,":",0]
[null,null,null,null,null,null,491,58,60,"TM 58","-","TM 60",3,":",0]
[null,null,null,null,null,null,492,62,112,"TM 62","-","TM 112",0,":",0]
[null,null,null,null,null,null,493,13,55,"Juventus Turin","-","TM 55",1,":",0]
[null,null,null,null,null,null,494,122,111,"TM 122","-","TM 111",0,":",3]
[null,null,null,null,null,null,495,52,100,"TM 52","-","TM 100",5,":",1]
[null,null,null,null,null,null,496,164,53,"TM 164","-","TM 53",0,":",4]
[null,null,null,null,null,null,497,197,54,"TM 197","-","TM 54",5,":",2]
[null,null,null,null,null,null,498,76,130,"TM 76","-","TM 130",3,":",1]
[null,null,null,null,null,null,499,189,125,"TM 189","-","TM 125",0,":",3]
[null,null,null,null,null,null,500,59,92,"TM 59","-","TM 92",9,":",2]
[null,null,null,null,null,null,501,21,137,"PSV Eindhoven","-","TM 137",3,":",1]
[null,null,null,null,null,null,502,18,23,"AC Mailand","-","Dinamo Zagreb",1,":",3]
[null,null,null,null,null,null,503,31,17,"FC Girona","-","Schachtjor Donezk",2,":",0]
[null,null,null,null,null,null,504,117,32,"TM 117","-","VfB Stuttgart",0,":",0]
[null,null,null,null,null,null,505,33,191,"Sturm Graz","-","TM 191",3,":",0]
[null,null,null,null,null,null,506,190,35,"TM 190","-","Eintracht Frankfurt",0,":",0]
[null,null,null,null,null,null,507,161,188,"TM 161","-","TM 188",1,":",0]
[null,null,null,null,null,null,508,116,138,"TM 116","-","TM 138",0,":",3]
[null,null,null,null,null,null,509,146,115,"TM 146","-","TM 115",5,":",1]
[null,null,null,null,null,null,510,20,47,"Sporting Lissabon","-","TM 47",0,":",4]
[null,null,null,null,null,null,511,153,109,"TM 153","-","TM 109",5,":",2]
[null,null,null,null,null,null,512,107,42,"TM 107","-","TM 42",1,":",3]
[null,null,null,null,null,null,513,43,12,"TM 43","-","Atalanta Bergamo",3,":",1]
[null,null,null,null,null,null,514,187,177,{"$f":"IFERROR(VLOOKUP($H519,$B$6:$C$205,2,0),\"\")","v":"TM 187"},"-",{"$f":"IFERROR(VLOOKUP($I519,$B$6:$C$205,2,0),\"\")","v":"TM 177"},0,":",2]
[null,null,null,null,null,null,515,150,186,"TM 150","-","TM 186",0,":",0]
[null,null,null,null,null,null,516,98,140,"TM 98","-","TM 140",0,":",3]
[null,null,null,null,null,null,517,126,185,"TM 126","-","TM 185",0,":",0]
[null,null,null,null,null,null,518,97,38,"TM 97","-","FC Basel",0,":",1]
[null,null,null,null,null,null,519,78,120,"TM 78","-","TM 120",3,":",0]
[null,null,null,null,null,null,520,11,71,"Atletico Madrid","-","TM 71",1,":",5]
[null,null,null,null,null,null,521,45,184,"TM 45","-","TM 184",4,":",0]
[null,null,null,null,null,null,522,93,199,"TM 93","-","TM 199",2,":",5]
[null,null,null,null,null,null,523,95,94,"TM 95","-","TM 94",1,":",3]
[null,null,null,null,null,null,524,30,166,"FC Bologna","-","TM 166",3,":",0]
[null,null,null,null,null,null,525,165,160,"TM 165","-","TM 160",2,":",9]
[null,null,null,null,null,null,526,106,73,"TM 106","-","TM 73",1,":",3]
[null,null,null,null,null,null,527,27,159,"Young Boys Bern","-","TM 159",3,":",1]
[null,null,null,null,null,null,528,148,168,"TM 148","-","TM 168",0,":",2]
[null,null,null,null,null,null,529,24,183,"Red Bull Salzburg","-","TM 183",0,":",0]
[null,null,null,null,null,null,530,180,157,"TM 180","-","TM 157",0,":",3]
[null,null,null,null,null,null,531,39,8,"FC Lille","-","RB Leipzig",0,":",0]
[null,null,null,null,null,null,532,110,192,"TM 110","-","TM 192",0,":",1]
[null,null,null,null,null,null,533,34,89,"Stade Brest","-","TM 89",3,":",0]
[null,null,null,null,null,null,534,7,129,"Borussia Dortmund","-","TM 129",1,":",5]
[null,null,null,null,null,null,535,162,87,"TM 162","-","TM 87",4,":",0]
[null,null,null,null,null,null,536,176,147,"TM 176","-","TM 147",2,":",5]
[null,null,null,null,null,null,537,36,91,"Mainz 05","-","TM 91",3,":",1]
[null,null,null,null,null,null,538,86,182,"TM 86","-","TM 182",0,":",3]
[null,null,null,null,null,null,539,84,85,"TM 84","-","TM 85",9,":",2]
[null,null,null,null,null,null,540,83,194,"TM 83","-","TM 194",3,":",1]
[null,null,null,null,null,null,541,99,175,"TM 99","-","TM 175",1,":",3]
[null,null,null,null,null,null,542,174,16,"TM 174","-","FC Brügge",2,":",0]
[null,null,null,null,null,null,543,163,10,"TM 163","-","Bayer Leverkusen",0,":",0]
[null,null,null,null,null,null,544,19,74,"Feyenoord Rotterdam","-","TM 74",3,":",0]
[null,null,null,null,null,null,545,178,77,"TM 178","-","TM 77",0,":",0]
[null,null,null,null,null,null,546,6,81,"Inter Mailand","-","TM 81",1,":",0]
[null,null,null,null,null,null,547,108,104,"TM 108","-","TM 104",0,":",3]
[null,null,null,null,null,null,548,134,57,"TM 134","-","TM 57",5,":",1]
[null,null,null,null,null,null,549,14,145,"Benfica Lissabon","-","TM 145",0,":",4]
[null,null,null,null,null,null,550,75,68,"TM 75","-","TM 68",5,":",2]
[null,null,null,null,null,null,551,118,158,"TM 118","-","TM 158",3,":",1]
[null,null,null,null,null,null,552,132,171,"TM 132","-","TM 171",0,":",3]
[null,null,null,null,null,null,553,88,4,"TM 88","-","Paris Saint-Germain",9,":",2]
[null,null,null,null,null,null,554,29,44,"Aston Villa","-","TM 44",2,":",1]
[null,null,null,null,null,null,555,48,72,"TM 48","-","TM 72",1,":",3]
[null,null,null,null,null,null,556,144,63,"TM 144","-","TM 63",2,":",0]
[null,null,null,null,null,null,557,25,156,"OSC Lille","-","TM 156",0,":",0]
[null,null,null,null,null,null,558,173,49,"TM 173","-","TM 49",3,":",0]
[null,null,null,null,null,null,559,40,102,"Hertha BSC","-","TM 102",0,":",0]
[null,null,null,null,null,null,560,181,113,"TM 181","-","TM 113",1,":",0]
[null,null,null,null,null,null,561,46,3,"TM 46","-","FC Bayern München",0,":",3]
[null,null,null,null,null,null,562,142,133,"TM 142","-","TM 133",5,":",1]
[null,null,null,null,null,null,563,5,103,"FC Liverpool","-","TM 103",0,":",4]
[null,null,null,null,null,null,564,70,2,"TM 70","-","Manchester City",5,":",2]
[null,null,null,null,null,null,565,66,172,"TM 66","-","TM 172",3,":",1]
[null,null,null,null,null,null,566,155,51,"TM 155","-","TM 51",0,":",3]
[null,null,null,null,null,null,567,151,69,"TM 151","-","TM 69",9,":",2]
[null,null,null,null,null,null,568,28,127,"AS Monaco","-","TM 127",3,":",1]
[null,null,null,null,null,null,569,64,170,"TM 64","-","TM 170",1,":",3]
[null,null,null,null,null,null,570,152,195,"TM 152","-","TM 195",2,":",0]
[null,null,null,null,null,null,571,154,141,"TM 154","-","TM 141",0,":",0]
[null,null,null,null,null,null,572,167,65,"TM 167","-","TM 65",3,":",0]
[null,null,null,null,null,null,573,67,61,"TM 67","-","TM 61",0,":",0]
[null,null,null,null,null,null,574,114,196,"TM 114","-","TM 196",1,":",0]
[null,null,null,null,null,null,575,193,80,"TM 193","-","TM 80",0,":",3]
[null,null,null,null,null,null,576,135,90,"TM 135","-","TM 90",5,":",1]
[null,null,null,null,null,null,577,9,37,"FC Barcelona","-","AC Roma",0,":",4]
[null,null,null,null,null,null,578,169,149,{"$f":"IFERROR(VLOOKUP($H583,$B$6:$C$205,2,0),\"\")","v":"TM 169"},"-",{"$f":"IFERROR(VLOOKUP($I583,$B$6:$C$205,2,0),\"\")","v":"TM 149"},5,":",2]
[null,null,null,null,null,null,579,26,82,"Roter Stern Belgrad","-","TM 82",1,":",3]
[null,null,null,null,null,null,580,101,143,"TM 101","-","TM 143",3,":",1]
[null,null,null,null,null,null,581,41,123,"TM 41","-","TM 123",0,":",2]
[null,null,null,null,null,null,582,179,128,"TM 179","-","TM 128",0,":",0]
[null,null,null,null,null,null,583,119,56,"TM 119","-","TM 56",0,":",3]
[null,null,null,null,null,null,584,121,50,"TM 121","-","TM 50",0,":",0]
[null,null,null,null,null,null,585,79,105,"TM 79","-","TM 105",0,":",1]
[null,null,null,null,null,null,586,136,96,"TM 136","-","TM 96",3,":",0]
[null,null,null,null,null,null,587,22,198,"Celtic Glasgow","-","TM 198",1,":",5]
[null,null,null,null,null,null,588,15,139,"FC Arsenal","-","TM 139",4,":",0]
[null,null,null,null,null,null,589,200,131,"TM 200","-","TM 131",2,":",5]
[null,null,null,null,null,null,590,60,124,"TM 60","-","TM 124",1,":",3]
[null,null,null,null,null,null,591,1,62,"Real Madrid","-","TM 62",3,":",0]
[null,null,null,null,null,null,592,55,58,"TM 55","-","TM 58",2,":",9]
[null,null,null,null,null,null,593,112,122,"TM 112","-","TM 122",1,":",3]
[null,null,null,null,null,null,594,100,13,"TM 100","-","Juventus Turin",3,":",1]
[null,null,null,null,null,null,595,111,164,"TM 111","-","TM 164",0,":",2]
[null,null,null,null,null,null,596,54,52,"TM 54","-","TM 52",0,":",0]
[null,null,null,null,null,null,597,53,76,"TM 53","-","TM 76",0,":",3]
[null,null,null,null,null,null,598,125,197,"TM 125","-","TM 197",0,":",0]
[null,null,null,null,null,null,599,130,59,"TM 130","-","TM 59",0,":",1]
[null,null,null,null,null,null,600,92,189,"TM 92","-","TM 189",3,":",0]
[null,null,null,null,null,null,601,137,18,"TM 137","-","AC Mailand",1,":",5]
[null,null,null,null,null,null,602,17,21,"Schachtjor Donezk","-","PSV Eindhoven",4,":",0]
[null,null,null,null,null,null,603,23,117,"Dinamo Zagreb","-","TM 117",2,":",5]
[null,null,null,null,null,null,604,191,31,"TM 191","-","FC Girona",3,":",1]
[null,null,null,null,null,null,605,32,190,"VfB Stuttgart","-","TM 190",0,":",3]
[null,null,null,null,null,null,606,188,33,"TM 188","-","Sturm Graz",9,":",2]
[null,null,null,null,null,null,607,35,116,"Eintracht Frankfurt","-","TM 116",3,":",1]
[null,null,null,null,null,null,608,115,161,"TM 115","-","TM 161",1,":",3]
[null,null,null,null,null,null,609,138,20,"TM 138","-","Sporting Lissabon",2,":",0]
[null,null,null,null,null,null,610,109,146,"TM 109","-","TM 146",0,":",0]
[null,null,null,null,null,null,611,47,107,"TM 47","-","TM 107",3,":",0]
[null,null,null,null,null,null,612,12,153,"Atalanta Bergamo","-","TM 153",0,":",0]
[null,null,null,null,null,null,613,42,187,"TM 42","-","TM 187",1,":",0]
[null,null,null,null,null,null,614,186,43,"TM 186","-","TM 43",0,":",3]
[null,null,null,null,null,null,615,177,98,"TM 177","-","TM 98",5,":",1]
[null,null,null,null,null,null,616,185,150,"TM 185","-","TM 150",0,":",4]
[null,null,null,null,null,null,617,140,97,"TM 140","-","TM 97",5,":",2]
[null,null,null,null,null,null,618,120,126,"TM 120","-","TM 126",3,":",1]
[null,null,null,null,null,null,619,38,11,"FC Basel","-","Atletico Madrid",0,":",3]
[null,null,null,null,null,null,620,184,78,"TM 184","-","TM 78",9,":",2]
[null,null,null,null,null,null,621,71,93,"TM 71","-","TM 93",2,":",1]
[null,null,null,null,null,null,622,94,45,"TM 94","-","TM 45",1,":",3]
[null,null,null,null,null,null,623,199,30,"TM 199","-","FC Bologna",2,":",0]
[null,null,null,null,null,null,624,160,95,"TM 160","-","TM 95",0,":",0]
[null,null,null,null,null,null,625,166,106,"TM 166","-","TM 106",3,":",0]
[null,null,null,null,null,null,626,159,165,"TM 159","-","TM 165",0,":",0]
[null,null,null,null,null,null,627,73,148,"TM 73","-","TM 148",1,":",0]
[null,null,null,null,null,null,628,183,27,"TM 183","-","Young Boys Bern",0,":",3]
[null,null,null,null,null,null,629,168,180,"TM 168","-","TM 180",5,":",1]
[null,null,null,null,null,null,630,8,24,"RB Leipzig","-","Red Bull Salzburg",0,":",4]
[null,null,null,null,null,null,631,157,110,"TM 157","-","TM 110",5,":",2]
[null,null,null,null,null,null,632,89,39,"TM 89","-","FC Lille",3,":",1]
[null,null,null,null,null,null,633,192,7,"TM 192","-","Borussia Dortmund",0,":",3]
[null,null,null,null,null,null,634,87,34,"TM 87","-","Stade Brest",9,":",2]
[null,null,null,null,null,null,635,129,176,"TM 129","-","TM 176",3,":",1]
[null,null,null,null,null,null,636,91,162,"TM 91","-","TM 162",1,":",3]
[null,null,null,null,null,null,637,147,86,"TM 147","-","TM 86",2,":",0]
[null,null,null,null,null,null,638,85,36,"TM 85","-","Mainz 05",0,":",0]
[null,null,null,null,null,null,639,182,83,"TM 182","-","TM 83",3,":",0]
[null,null,null,null,null,null,640,175,84,"TM 175","-","TM 84",0,":",0]
[null,null,null,null,null,null,641,194,174,"TM 194","-","TM 174",1,":",0]
[null,null,null,null,null,null,642,10,99,{"$f":"IFERROR(VLOOKUP($H647,$B$6:$C$205,2,0),\"\")","v":"Bayer Leverkusen"},"-",{"$f":"IFERROR(VLOOKUP($I647,$B$6:$C$205,2,0),\"\")","v":"TM 99"},0,":",3]
[null,null,null,null,null,null,643,16,19,"FC Brügge","-","Feyenoord Rotterdam",5,":",1]
[null,null,null,null,null,null,644,77,163,"TM 77","-","TM 163",0,":",4]
[null,null,null,null,null,null,645,74,6,"TM 74","-","Inter Mailand",5,":",2]
[null,null,null,null,null,null,646,104,178,"TM 104","-","TM 178",1,":",3]
[null,null,null,null,null,null,647,81,134,"TM 81","-","TM 134",3,":",1]
[null,null,null,null,null,null,648,145,108,"TM 145","-","TM 108",0,":",2]
[null,null,null,null,null,null,649,57,75,"TM 57","-","TM 75",0,":",0]
[null,null,null,null,null,null,650,158,14,"TM 158","-","Benfica Lissabon",0,":",3]
[null,null,null,null,null,null,651,68,132,"TM 68","-","TM 132",0,":",0]
[null,null,null,null,null,null,652,4,118,"Paris Saint-Germain","-","TM 118",0,":",1]
[null,null,null,null,null,null,653,171,29,"TM 171","-","Aston Villa",3,":",0]
[null,null,null,null,null,null,654,72,88,"TM 72","-","TM 88",1,":",5]
[null,null,null,null,null,null,655,44,144,"TM 44","-","TM 144",4,":",0]
[null,null,null,null,null,null,656,156,48,"TM 156","-","TM 48",2,":",5]
[null,null,null,null,null,null,657,63,173,"TM 63","-","TM 173",1,":",3]
[null,null,null,null,null,null,658,102,25,"TM 102","-","OSC Lille",3,":",0]
[null,null,null,null,null,null,659,49,181,"TM 49","-","TM 181",2,":",9]
[null,null,null,null,null,null,660,3,40,"FC Bayern München","-","Hertha BSC",1,":",3]
[null,null,null,null,null,null,661,113,142,"TM 113","-","TM 142",3,":",1]
[null,null,null,null,null,null,662,103,46,"TM 103","-","TM 46",0,":",2]
[null,null,null,null,null,null,663,133,70,"TM 133","-","TM 70",0,":",0]
[null,null,null,null,null,null,664,172,5,"TM 172","-","FC Liverpool",0,":",3]
[null,null,null,null,null,null,665,2,155,"Manchester City","-","TM 155",0,":",0]
[null,null,null,null,null,null,666,69,66,"TM 69","-","TM 66",0,":",1]
[null,null,null,null,null,null,667,51,28,"TM 51","-","AS Monaco",3,":",0]
[null,null,null,null,null,null,668,170,151,"TM 170","-","TM 151",1,":",5]
[null,null,null,null,null,null,669,127,152,"TM 127","-","TM 152",4,":",0]
[null,null,null,null,null,null,670,141,64,"TM 141","-","TM 64",2,":",5]
[null,null,null,null,null,null,671,195,167,"TM 195","-","TM 167",3,":",1]
[null,null,null,null,null,null,672,61,154,"TM 61","-","TM 154",0,":",3]
[null,null,null,null,null,null,673,65,114,"TM 65","-","TM 114",9,":",2]
[null,null,null,null,null,null,674,80,67,"TM 80","-","TM 67",3,":",1]
[null,null,null,null,null,null,675,196,135,"TM 196","-","TM 135",1,":",3]
[null,null,null,null,null,null,676,37,193,"AC Roma","-","TM 193",2,":",0]
[null,null,null,null,null,null,677,90,169,"TM 90","-","TM 169",0,":",0]
[null,null,null,null,null,null,678,82,9,"TM 82","-","FC Barcelona",3,":",0]
[null,null,null,null,null,null,679,149,101,"TM 149","-","TM 101",0,":",0]
[null,null,null,null,null,null,680,123,26,"TM 123","-","Roter Stern Belgrad",1,":",0]
[null,null,null,null,null,null,681,143,179,"TM 143","-","TM 179",0,":",3]
[null,null,null,null,null,null,682,56,41,"TM 56","-","TM 41",5,":",1]
[null,null,null,null,null,null,683,128,121,"TM 128","-","TM 121",0,":",4]
[null,null,null,null,null,null,684,105,119,"TM 105","-","TM 119",5,":",2]
[null,null,null,null,null,null,685,50,136,"TM 50","-","TM 136",3,":",1]
[null,null,null,null,null,null,686,198,79,"TM 198","-","TM 79",0,":",3]
[null,null,null,null,null,null,687,96,15,"TM 96","-","FC Arsenal",9,":",2]
[null,null,null,null,null,null,688,131,22,"TM 131","-","Celtic Glasgow",2,":",1]
[null,null,null,null,null,null,689,139,60,"TM 139","-","TM 60",1,":",3]
[null,null,null,null,null,null,690,62,200,"TM 62","-","TM 200",2,":",0]
[null,null,null,null,null,null,691,124,55,"TM 124","-","TM 55",0,":",0]
[null,null,null,null,null,null,692,122,1,"TM 122","-","Real Madrid",3,":",0]
[null,null,null,null,null,null,693,58,100,"TM 58","-","TM 100",0,":",0]
[null,null,null,null,null,null,694,164,112,"TM 164","-","TM 112",1,":",0]
[null,null,null,null,null,null,695,13,54,"Juventus Turin","-","TM 54",0,":",3]
[null,null,null,null,null,null,696,76,111,"TM 76","-","TM 111",5,":",1]
[null,null,null,null,null,null,697,52,125,"TM 52","-","TM 125",0,":",4]
[null,null,null,null,null,null,698,59,53,"TM 59","-","TM 53",5,":",2]
[null,null,null,null,null,null,699,197,92,"TM 197","-","TM 92",3,":",1]
[null,null,null,null,null,null,700,189,130,"TM 189","-","TM 130",0,":",3]
[null,null,null,null,null,null,701,17,137,"Schachtjor Donezk","-","TM 137",9,":",2]
[null,null,null,null,null,null,702,117,18,"TM 117","-","AC Mailand",3,":",1]
[null,null,null,null,null,null,703,21,191,"PSV Eindhoven","-","TM 191",1,":",3]
[null,null,null,null,null,null,704,190,23,"TM 190","-","Dinamo Zagreb",2,":",0]
[null,null,null,null,null,null,705,31,188,"FC Girona","-","TM 188",0,":",0]
[null,null,null,null,null,null,706,116,32,{"$f":"IFERROR(VLOOKUP($H711,$B$6:$C$205,2,0),\"\")","v":"TM 116"},"-",{"$f":"IFERROR(VLOOKUP($I711,$B$6:$C$205,2,0),\"\")","v":"VfB Stuttgart"},3,":",0]
[null,null,null,null,null,null,707,33,115,"Sturm Graz","-","TM 115",0,":",0]
[null,null,null,null,null,null,708,20,35,"Sporting Lissabon","-","Eintracht Frankfurt",1,":",0]
[null,null,null,null,null,null,709,161,109,"TM 161","-","TM 109",0,":",3]
[null,null,null,null,null,null,710,107,138,"TM 107","-","TM 138",5,":",1]
[null,null,null,null,null,null,711,146,12,"TM 146","-","Atalanta Bergamo",0,":",4]
[null,null,null,null,null,null,712,187,47,"TM 187","-","TM 47",5,":",2]
[null,null,null,null,null,null,713,153,186,"TM 153","-","TM 186",1,":",3]
[null,null,null,null,null,null,714,98,42,"TM 98","-","TM 42",3,":",1]
[null,null,null,null,null,null,715,43,185,"TM 43","-","TM 185",0,":",2]
[null,null,null,null,null,null,716,97,177,"TM 97","-","TM 177",0,":",0]
[null,null,null,null,null,null,717,150,120,"TM 150","-","TM 120",0,":",3]
[null,null,null,null,null,null,718,11,140,"Atletico Madrid","-","TM 140",0,":",0]
[null,null,null,null,null,null,719,126,184,"TM 126","-","TM 184",0,":",1]
[null,null,null,null,null,null,720,93,38,"TM 93","-","FC Basel",3,":",0]
[null,null,null,null,null,null,721,78,94,"TM 78","-","TM 94",1,":",5]
[null,null,null,null,null,null,722,30,71,"FC Bologna","-","TM 71",4,":",0]
[null,null,null,null,null,null,723,45,160,"TM 45","-","TM 160",2,":",5]
[null,null,null,null,null,null,724,106,199,"TM 106","-","TM 199",1,":",3]
[null,null,null,null,null,null,725,95,159,"TM 95","-","TM 159",3,":",0]
[null,null,null,null,null,null,726,148,166,"TM 148","-","TM 166",2,":",9]
[null,null,null,null,null,null,727,165,183,"TM 165","-","TM 183",1,":",3]
[null,null,null,null,null,null,728,180,73,"TM 180","-","TM 73",3,":",1]
[null,null,null,null,null,null,729,27,8,"Young Boys Bern","-","RB Leipzig",0,":",2]
[null,null,null,null,null,null,730,110,168,"TM 110","-","TM 168",0,":",0]
[null,null,null,null,null,null,731,24,89,"Red Bull Salzburg","-","TM 89",0,":",3]
[null,null,null,null,null,null,732,7,157,"Borussia Dortmund","-","TM 157",0,":",0]
[null,null,null,null,null,null,733,39,87,"FC Lille","-","TM 87",0,":",1]
[null,null,null,null,null,null,734,176,192,"TM 176","-","TM 192",3,":",0]
[null,null,null,null,null,null,735,34,91,"Stade Brest","-","TM 91",1,":",5]
[null,null,null,null,null,null,736,86,129,"TM 86","-","TM 129",4,":",0]
[null,null,null,null,null,null,737,162,85,"TM 162","-","TM 85",2,":",5]
[null,null,null,null,null,null,738,83,147,"TM 83","-","TM 147",3,":",1]
[null,null,null,null,null,null,739,36,175,"Mainz 05","-","TM 175",0,":",3]
[null,null,null,null,null,null,740,174,182,"TM 174","-","TM 182",9,":",2]
[null,null,null,null,null,null,741,84,10,"TM 84","-","Bayer Leverkusen",3,":",1]
[null,null,null,null,null,null,742,19,194,"Feyenoord Rotterdam","-","TM 194",1,":",3]
[null,null,null,null,null,null,743,99,77,"TM 99","-","TM 77",2,":",0]
[null,null,null,null,null,null,744,6,16,"Inter Mailand","-","FC Brügge",0,":",0]
[null,null,null,null,null,null,745,163,104,"TM 163","-","TM 104",3,":",0]
[null,null,null,null,null,null,746,134,74,"TM 134","-","TM 74",0,":",0]
[null,null,null,null,null,null,747,178,145,"TM 178","-","TM 145",1,":",0]
[null,null,null,null,null,null,748,75,81,"TM 75","-","TM 81",0,":",3]
[null,null,null,null,null,null,749,108,158,"TM 108","-","TM 158",5,":",1]
[null,null,null,null,null,null,750,132,57,"TM 132","-","TM 57",0,":",4]
[null,null,null,null,null,null,751,14,4,"Benfica Lissabon","-","Paris Saint-Germain",5,":",2]
[null,null,null,null,null,null,752,29,68,"Aston Villa","-","TM 68",3,":",1]
[null,null,null,null,null,null,753,118,72,"TM 118","-","TM 72",0,":",3]
[null,null,null,null,null,null,754,144,171,"TM 144","-","TM 171",9,":",2]
[null,null,null,null,null,null,755,88,156,"TM 88","-","TM 156",2,":",1]
[null,null,null,null,null,null,756,173,44,"TM 173","-","TM 44",1,":",3]
[null,null,null,null,null,null,757,48,102,"TM 48","-","TM 102",2,":",0]
[null,null,null,null,null,null,758,181,63,"TM 181","-","TM 63",0,":",0]
[null,null,null,null,null,null,759,25,3,"OSC Lille","-","FC Bayern München",3,":",0]
[null,null,null,null,null,null,760,142,49,"TM 142","-","TM 49",0,":",0]
[null,null,null,null,null,null,761,40,103,"Hertha BSC","-","TM 103",1,":",0]
[null,null,null,null,null,null,762,70,113,"TM 70","-","TM 113",0,":",3]
[null,null,null,null,null,null,763,46,172,"TM 46","-","TM 172",5,":",1]
[null,null,null,null,null,null,764,155,133,"TM 155","-","TM 133",0,":",4]
[null,null,null,null,null,null,765,5,69,"FC Liverpool","-","TM 69",5,":",2]
[null,null,null,null,null,null,766,28,2,"AS Monaco","-","Manchester City",3,":",1]
[null,null,null,null,null,null,767,66,170,"TM 66","-","TM 170",0,":",3]
[null,null,null,null,null,null,768,152,51,"TM 152","-","TM 51",9,":",2]
[null,null,null,null,null,null,769,151,141,"TM 151","-","TM 141",3,":",1]
[null,null,null,null,null,null,770,167,127,{"$f":"IFERROR(VLOOKUP($H775,$B$6:$C$205,2,0),\"\")","v":"TM 167"},"-",{"$f":"IFERROR(VLOOKUP($I775,$B$6:$C$205,2,0),\"\")","v":"TM 127"},1,":",3]
[null,null,null,null,null,null,771,64,61,"TM 64","-","TM 61",2,":",0]
[null,null,null,null,null,null,772,114,195,"TM 114","-","TM 195",0,":",0]
[null,null,null,null,null,null,773,154,80,"TM 154","-","TM 80",3,":",0]
[null,null,null,null,null,null,774,135,65,"TM 135","-","TM 65",0,":",0]
[null,null,null,null,null,null,775,67,37,"TM 67","-","AC Roma",1,":",0]
[null,null,null,null,null,null,776,169,196,"TM 169","-","TM 196",0,":",3]
[null,null,null,null,null,null,777,193,82,"TM 193","-","TM 82",5,":",1]
[null,null,null,null,null,null,778,101,90,"TM 101","-","TM 90",0,":",4]
[null,null,null,null,null,null,779,9,123,"FC Barcelona","-","TM 123",5,":",2]
[null,null,null,null,null,null,780,179,149,"TM 179","-","TM 149",1,":",3]
[null,null,null,null,null,null,781,26,56,"Roter Stern Belgrad","-","TM 56",3,":",1]
[null,null,null,null,null,null,782,121,143,"TM 121","-","TM 143",0,":",2]
[null,null,null,null,null,null,783,41,105,"TM 41","-","TM 105",0,":",0]
[null,null,null,null,null,null,784,136,128,"TM 136","-","TM 128",0,":",3]
[null,null,null,null,null,null,785,119,198,"TM 119","-","TM 198",0,":",0]
[null,null,null,null,null,null,786,15,50,"FC Arsenal","-","TM 50",0,":",1]
[null,null,null,null,null,null,787,79,131,"TM 79","-","TM 131",3,":",0]
[null,null,null,null,null,null,788,60,96,"TM 60","-","TM 96",1,":",5]
[null,null,null,null,null,null,789,22,62,"Celtic Glasgow","-","TM 62",4,":",0]
[null,null,null,null,null,null,790,55,139,"TM 55","-","TM 139",2,":",5]
[null,null,null,null,null,null,791,200,122,"TM 200","-","TM 122",1,":",3]
[null,null,null,null,null,null,792,100,124,"TM 100","-","TM 124",3,":",0]
[null,null,null,null,null,null,793,1,164,"Real Madrid","-","TM 164",2,":",9]
[null,null,null,null,null,null,794,54,58,"TM 54","-","TM 58",1,":",3]
[null,null,null,null,null,null,795,112,76,"TM 112","-","TM 76",3,":",1]
[null,null,null,null,null,null,796,125,13,"TM 125","-","Juventus Turin",0,":",2]
[null,null,null,null,null,null,797,111,59,"TM 111","-","TM 59",3,":",4]
[null,null,null,null,null,null,798,92,52,"TM 92","-","TM 52",0,":",3]
[null,null,null,null,null,null,799,53,189,"TM 53","-","TM 189",9,":",2]
[null,null,null,null,null,null,800,130,197,"TM 130","-","TM 197",3,":",1]
[null,null,null,null,null,null,801,137,117,"TM 137","-","TM 117",1,":",3]
[null,null,null,null,null,null,802,191,17,"TM 191","-","Schachtjor Donezk",2,":",0]
[null,null,null,null,null,null,803,18,190,"AC Mailand","-","TM 190",0,":",0]
[null,null,null,null,null,null,804,188,21,"TM 188","-","PSV Eindhoven",3,":",0]
[null,null,null,null,null,null,805,23,116,"Dinamo Zagreb","-","TM 116",0,":",0]
[null,null,null,null,null,null,806,115,31,"TM 115","-","FC Girona",1,":",2]
[null,null,null,null,null,null,807,32,20,"VfB Stuttgart","-","Sporting Lissabon",0,":",3]
[null,null,null,null,null,null,808,109,33,"TM 109","-","Sturm Graz",5,":",1]
[null,null,null,null,null,null,809,35,107,"Eintracht Frankfurt","-","TM 107",0,":",4]
[null,null,null,null,null,null,810,12,161,"Atalanta Bergamo","-","TM 161",5,":",2]
[null,null,null,null,null,null,811,138,187,"TM 138","-","TM 187",3,":",1]
[null,null,null,null,null,null,812,186,146,"TM 186","-","TM 146",0,":",3]
[null,null,null,null,null,null,813,47,98,"TM 47","-","TM 98",9,":",2]
[null,null,null,null,null,null,814,185,153,"TM 185","-","TM 153",2,":",1]
[null,null,null,null,null,null,815,42,97,"TM 42","-","TM 97",1,":",3]
[null,null,null,null,null,null,816,120,43,"TM 120","-","TM 43",2,":",0]
[null,null,null,null,null,null,817,177,11,"TM 177","-","Atletico Madrid",0,":",0]
[null,null,null,null,null,null,818,184,150,"TM 184","-","TM 150",3,":",0]
[null,null,null,null,null,null,819,140,93,"TM 140","-","TM 93",0,":",0]
[null,null,null,null,null,null,820,94,126,"TM 94","-","TM 126",1,":",5]
[null,null,null,null,null,null,821,38,30,"FC Basel","-","FC Bologna",0,":",3]
[null,null,null,null,null,null,822,160,78,"TM 160","-","TM 78",5,":",1]
[null,null,null,null,null,null,823,71,106,"TM 71","-","TM 106",0,":",4]
[null,null,null,null,null,null,824,159,45,"TM 159","-","TM 45",5,":",2]
[null,null,null,null,null,null,825,199,148,"TM 199","-","TM 148",3,":",1]
[null,null,null,null,null,null,826,183,95,"TM 183","-","TM 95",0,":",3]
[null,null,null,null,null,null,827,166,180,"TM 166","-","TM 180",9,":",2]
[null,null,null,null,null,null,828,8,165,"RB Leipzig","-","TM 165",3,":",1]
[null,null,null,null,null,null,829,73,110,"TM 73","-","TM 110",1,":",3]
[null,null,null,null,null,null,830,89,27,"TM 89","-","Young Boys Bern",2,":",0]
[null,null,null,null,null,null,831,168,7,"TM 168","-","Borussia Dortmund",0,":",0]
[null,null,null,null,null,null,832,87,24,"TM 87","-","Red Bull Salzburg",3,":",0]
[null,null,null,null,null,null,833,157,176,"TM 157","-","TM 176",0,":",0]
[null,null,null,null,null,null,834,91,39,{"$f":"IFERROR(VLOOKUP($H839,$B$6:$C$205,2,0),\"\")","v":"TM 91"},"-",{"$f":"IFERROR(VLOOKUP($I839,$B$6:$C$205,2,0),\"\")","v":"FC Lille"},1,":",0]
[null,null,null,null,null,null,835,192,86,"TM 192","-","TM 86",0,":",3]
[null,null,null,null,null,null,836,85,34,"TM 85","-","Stade Brest",5,":",1]
[null,null,null,null,null,null,837,129,83,"TM 129","-","TM 83",0,":",4]
[null,null,null,null,null,null,838,175,162,"TM 175","-","TM 162",5,":",2]
[null,null,null,null,null,null,839,147,174,"TM 147","-","TM 174",1,":",3]
[null,null,null,null,null,null,840,10,36,"Bayer Leverkusen","-","Mainz 05",3,":",1]
[null,null,null,null,null,null,841,182,19,"TM 182","-","Feyenoord Rotterdam",0,":",2]
[null,null,null,null,null,null,842,77,84,"TM 77","-","TM 84",0,":",0]
[null,null,null,null,null,null,843,194,6,"TM 194","-","Inter Mailand",0,":",3]
[null,null,null,null,null,null,844,104,99,"TM 104","-","TM 99",0,":",0]
[null,null,null,null,null,null,845,16,134,"FC Brügge","-","TM 134",0,":",1]
[null,null,null,null,null,null,846,145,163,"TM 145","-","TM 163",3,":",0]
[null,null,null,null,null,null,847,74,75,"TM 74","-","TM 75",1,":",5]
[null,null,null,null,null,null,848,158,178,"TM 158","-","TM 178",4,":",0]
[null,null,null,null,null,null,849,81,132,"TM 81","-","TM 132",2,":",5]
[null,null,null,null,null,null,850,4,108,"Paris Saint-Germain","-","TM 108",1,":",3]
[null,null,null,null,null,null,851,57,29,"TM 57","-","Aston Villa",3,":",0]
[null,null,null,null,null,null,852,72,14,"TM 72","-","Benfica Lissabon",2,":",9]
[null,null,null,null,null,null,853,68,144,"TM 68","-","TM 144",1,":",3]
[null,null,null,null,null,null,854,156,118,"TM 156","-","TM 118",3,":",1]
[null,null,null,null,null,null,855,171,173,"TM 171","-","TM 173",0,":",2]
[null,null,null,null,null,null,856,102,88,"TM 102","-","TM 88",0,":",0]
[null,null,null,null,null,null,857,44,181,"TM 44","-","TM 181",0,":",3]
[null,null,null,null,null,null,858,3,48,"FC Bayern München","-","TM 48",0,":",0]
[null,null,null,null,null,null,859,63,142,"TM 63","-","TM 142",0,":",1]
[null,null,null,null,null,null,860,103,25,"TM 103","-","OSC Lille",3,":",0]
[null,null,null,null,null,null,861,49,70,"TM 49","-","TM 70",1,":",5]
[null,null,null,null,null,null,862,172,40,"TM 172","-","Hertha BSC",4,":",0]
[null,null,null,null,null,null,863,113,155,"TM 113","-","TM 155",2,":",5]
[null,null,null,null,null,null,864,69,46,"TM 69","-","TM 46",3,":",1]
[null,null,null,null,null,null,865,133,28,"TM 133","-","AS Monaco",0,":",3]
[null,null,null,null,null,null,866,170,5,"TM 170","-","FC Liverpool",9,":",2]
[null,null,null,null,null,null,867,2,152,"Manchester City","-","TM 152",3,":",1]
[null,null,null,null,null,null,868,141,66,"TM 141","-","TM 66",1,":",3]
[null,null,null,null,null,null,869,51,167,"TM 51","-","TM 167",2,":",0]
[null,null,null,null,null,null,870,61,151,"TM 61","-","TM 151",0,":",0]
[null,null,null,null,null,null,871,127,114,"TM 127","-","TM 114",3,":",0]
[null,null,null,null,null,null,872,80,64,"TM 80","-","TM 64",0,":",0]
[null,null,null,null,null,null,873,195,135,"TM 195","-","TM 135",1,":",0]
[null,null,null,null,null,null,874,37,154,"AC Roma","-","TM 154",0,":",3]
[null,null,null,null,null,null,875,65,169,"TM 65","-","TM 169",5,":",1]
[null,null,null,null,null,null,876,82,67,"TM 82","-","TM 67",0,":",4]
[null,null,null,null,null,null,877,196,101,"TM 196","-","TM 101",5,":",2]
[null,null,null,null,null,null,878,123,193,"TM 123","-","TM 193",3,":",1]
[null,null,null,null,null,null,879,90,179,"TM 90","-","TM 179",0,":",3]
[null,null,null,null,null,null,880,56,9,"TM 56","-","FC Barcelona",9,":",2]
[null,null,null,null,null,null,881,149,121,"TM 149","-","TM 121",2,":",1]
[null,null,null,null,null,null,882,105,26,"TM 105","-","Roter Stern Belgrad",1,":",3]
[null,null,null,null,null,null,883,143,136,"TM 143","-","TM 136",2,":",0]
[null,null,null,null,null,null,884,198,41,"TM 198","-","TM 41",0,":",0]
[null,null,null,null,null,null,885,128,15,"TM 128","-","FC Arsenal",3,":",0]
[null,null,null,null,null,null,886,131,119,"TM 131","-","TM 119",0,":",0]
[null,null,null,null,null,null,887,50,60,"TM 50","-","TM 60",1,":",0]
[null,null,null,null,null,null,888,62,79,"TM 62","-","TM 79",0,":",3]
[null,null,null,null,null,null,889,96,55,"TM 96","-","TM 55",5,":",1]
[null,null,null,null,null,null,890,122,22,"TM 122","-","Celtic Glasgow",0,":",4]
[null,null,null,null,null,null,891,139,100,"TM 139","-","TM 100",5,":",2]
[null,null,null,null,null,null,892,164,200,"TM 164","-","TM 200",3,":",1]
[null,null,null,null,null,null,893,124,54,"TM 124","-","TM 54",0,":",3]
[null,null,null,null,null,null,894,76,1,"TM 76","-","Real Madrid",9,":",2]
[null,null,null,null,null,null,895,58,125,"TM 58","-","TM 125",3,":",1]
[null,null,null,null,null,null,896,59,112,"TM 59","-","TM 112",1,":",3]
[null,null,null,null,null,null,897,13,92,"Juventus Turin","-","TM 92",2,":",0]
[null,null,null,null,null,null,898,189,111,{"$f":"IFERROR(VLOOKUP($H903,$B$6:$C$205,2,0),\"\")","v":"TM 189"},"-",{"$f":"IFERROR(VLOOKUP($I903,$B$6:$C$205,2,0),\"\")","v":"TM 111"},0,":",0]
[null,null,null,null,null,null,899,52,130,"TM 52","-","TM 130",3,":",0]
[null,null,null,null,null,null,900,197,53,"TM 197","-","TM 53",0,":",0]
[null,null,null,null,null,null,901,191,137,"TM 191","-","TM 137",1,":",0]
[null,null,null,null,null,null,902,190,117,"TM 190","-","TM 117",0,":",3]
[null,null,null,null,null,null,903,17,188,"Schachtjor Donezk","-","TM 188",5,":",1]
[null,null,null,null,null,null,904,116,18,"TM 116","-","AC Mailand",0,":",4]
[null,null,null,null,null,null,905,21,115,"PSV Eindhoven","-","TM 115",5,":",2]
[null,null,null,null,null,null,906,20,23,"Sporting Lissabon","-","Dinamo Zagreb",1,":",3]
[null,null,null,null,null,null,907,31,109,"FC Girona","-","TM 109",3,":",1]
[null,null,null,null,null,null,908,107,32,"TM 107","-","VfB Stuttgart",0,":",2]
[null,null,null,null,null,null,909,33,12,"Sturm Graz","-","Atalanta Bergamo",0,":",0]
[null,null,null,null,null,null,910,187,35,"TM 187","-","Eintracht Frankfurt",0,":",3]
[null,null,null,null,null,null,911,161,186,"TM 161","-","TM 186",0,":",0]
[null,null,null,null,null,null,912,98,138,"TM 98","-","TM 138",0,":",1]
[null,null,null,null,null,null,913,146,185,"TM 146","-","TM 185",3,":",0]
[null,null,null,null,null,null,914,97,47,"TM 97","-","TM 47",1,":",5]
[null,null,null,null,null,null,915,153,120,"TM 153","-","TM 120",4,":",0]
[null,null,null,null,null,null,916,11,42,"Atletico Madrid","-","TM 42",2,":",5]
[null,null,null,null,null,null,917,43,184,"TM 43","-","TM 184",1,":",3]
[null,null,null,null,null,null,918,93,177,"TM 93","-","TM 177",3,":",0]
[null,null,null,null,null,null,919,150,94,"TM 150","-","TM 94",2,":",9]
[null,null,null,null,null,null,920,30,140,"FC Bologna","-","TM 140",1,":",3]
[null,null,null,null,null,null,921,126,160,"TM 126","-","TM 160",3,":",1]
[null,null,null,null,null,null,922,106,38,"TM 106","-","FC Basel",0,":",2]
[null,null,null,null,null,null,923,78,159,"TM 78","-","TM 159",0,":",0]
[null,null,null,null,null,null,924,148,71,"TM 148","-","TM 71",0,":",3]
[null,null,null,null,null,null,925,45,183,"TM 45","-","TM 183",0,":",0]
[null,null,null,null,null,null,926,180,199,"TM 180","-","TM 199",0,":",1]
[null,null,null,null,null,null,927,95,8,"TM 95","-","RB Leipzig",3,":",0]
[null,null,null,null,null,null,928,110,166,"TM 110","-","TM 166",1,":",5]
[null,null,null,null,null,null,929,165,89,"TM 165","-","TM 89",4,":",0]
[null,null,null,null,null,null,930,7,73,"Borussia Dortmund","-","TM 73",2,":",5]
[null,null,null,null,null,null,931,27,87,"Young Boys Bern","-","TM 87",3,":",1]
[null,null,null,null,null,null,932,176,168,"TM 176","-","TM 168",0,":",3]
[null,null,null,null,null,null,933,24,91,"Red Bull Salzburg","-","TM 91",9,":",2]
[null,null,null,null,null,null,934,86,157,"TM 86","-","TM 157",3,":",1]
[null,null,null,null,null,null,935,39,85,"FC Lille","-","TM 85",1,":",3]
[null,null,null,null,null,null,936,83,192,"TM 83","-","TM 192",2,":",0]
[null,null,null,null,null,null,937,34,175,"Stade Brest","-","TM 175",0,":",0]
[null,null,null,null,null,null,938,174,129,"TM 174","-","TM 129",3,":",0]
[null,null,null,null,null,null,939,162,10,"TM 162","-","Bayer Leverkusen",0,":",0]
[null,null,null,null,null,null,940,19,147,"Feyenoord Rotterdam","-","TM 147",1,":",0]
[null,null,null,null,null,null,941,36,77,"Mainz 05","-","TM 77",0,":",3]
[null,null,null,null,null,null,942,6,182,"Inter Mailand","-","TM 182",5,":",1]
[null,null,null,null,null,null,943,84,104,"TM 84","-","TM 104",0,":",4]
[null,null,null,null,null,null,944,134,194,"TM 134","-","TM 194",5,":",2]
[null,null,null,null,null,null,945,99,145,"TM 99","-","TM 145",3,":",1]
[null,null,null,null,null,null,946,75,16,"TM 75","-","FC Brügge",0,":",3]
[null,null,null,null,null,null,947,163,158,"TM 163","-","TM 158",9,":",2]
[null,null,null,null,null,null,948,132,74,"TM 132","-","TM 74",2,":",1]
[null,null,null,null,null,null,949,178,4,"TM 178","-","Paris Saint-Germain",1,":",3]
[null,null,null,null,null,null,950,29,81,"Aston Villa","-","TM 81",2,":",0]
[null,null,null,null,null,null,951,108,72,"TM 108","-","TM 72",0,":",0]
[null,null,null,null,null,null,952,144,57,"TM 144","-","TM 57",3,":",0]
[null,null,null,null,null,null,953,14,156,"Benfica Lissabon","-","TM 156",0,":",0]
[null,null,null,null,null,null,954,173,68,"TM 173","-","TM 68",1,":",0]
[null,null,null,null,null,null,955,118,102,"TM 118","-","TM 102",0,":",3]
[null,null,null,null,null,null,956,181,171,"TM 181","-","TM 171",5,":",1]
[null,null,null,null,null,null,957,88,3,"TM 88","-","FC Bayern München",0,":",4]
[null,null,null,null,null,null,958,142,44,"TM 142","-","TM 44",5,":",2]
[null,null,null,null,null,null,959,48,103,"TM 48","-","TM 103",3,":",1]
[null,null,null,null,null,null,960,70,63,"TM 70","-","TM 63",0,":",3]
[null,null,null,null,null,null,961,25,172,"OSC Lille","-","TM 172",9,":",2]
[null,null,null,null,null,null,962,155,49,{"$f":"IFERROR(VLOOKUP($H967,$B$6:$C$205,2,0),\"\")","v":"TM 155"},"-",{"$f":"IFERROR(VLOOKUP($I967,$B$6:$C$205,2,0),\"\")","v":"TM 49"},3,":",1]
[null,null,null,null,null,null,963,40,69,"Hertha BSC","-","TM 69",1,":",3]
[null,null,null,null,null,null,964,28,113,"AS Monaco","-","TM 113",2,":",0]
[null,null,null,null,null,null,965,46,170,"TM 46","-","TM 170",0,":",0]
[null,null,null,null,null,null,966,152,133,"TM 152","-","TM 133",3,":",0]
[null,null,null,null,null,null,967,5,141,"FC Liverpool","-","TM 141",0,":",0]
[null,null,null,null,null,null,968,167,2,"TM 167","-","Manchester City",1,":",0]
[null,null,null,null,null,null,969,66,61,"TM 66","-","TM 61",0,":",3]
[null,null,null,null,null,null,970,114,51,"TM 114","-","TM 51",5,":",1]
[null,null,null,null,null,null,971,151,80,"TM 151","-","TM 80",0,":",4]
[null,null,null,null,null,null,972,135,127,"TM 135","-","TM 127",5,":",2]
[null,null,null,null,null,null,973,64,37,"TM 64","-","AC Roma",1,":",3]
[null,null,null,null,null,null,974,169,195,"TM 169","-","TM 195",3,":",1]
[null,null,null,null,null,null,975,154,82,"TM 154","-","TM 82",0,":",2]
[null,null,null,null,null,null,976,101,65,"TM 101","-","TM 65",0,":",0]
[null,null,null,null,null,null,977,67,123,"TM 67","-","TM 123",0,":",3]
[null,null,null,null,null,null,978,179,196,"TM 179","-","TM 196",0,":",0]
[null,null,null,null,null,null,979,193,56,"TM 193","-","TM 56",0,":",1]
[null,null,null,null,null,null,980,121,90,"TM 121","-","TM 90",3,":",0]
[null,null,null,null,null,null,981,9,105,"FC Barcelona","-","TM 105",1,":",5]
[null,null,null,null,null,null,982,136,149,"TM 136","-","TM 149",4,":",0]
[null,null,null,null,null,null,983,26,198,"Roter Stern Belgrad","-","TM 198",2,":",5]
[null,null,null,null,null,null,984,15,143,"FC Arsenal","-","TM 143",1,":",3]
[null,null,null,null,null,null,985,41,131,"TM 41","-","TM 131",3,":",0]
[null,null,null,null,null,null,986,60,128,"TM 60","-","TM 128",2,":",9]
[null,null,null,null,null,null,987,119,62,"TM 119","-","TM 62",1,":",3]
[null,null,null,null,null,null,988,55,50,"TM 55","-","TM 50",3,":",1]
[null,null,null,null,null,null,989,79,122,"TM 79","-","TM 122",0,":",2]
[null,null,null,null,null,null,990,100,96,"TM 100","-","TM 96",0,":",0]
[null,null,null,null,null,null,991,22,164,"Celtic Glasgow","-","TM 164",0,":",3]
[null,null,null,null,null,null,992,54,139,"TM 54","-","TM 139",0,":",0]
[null,null,null,null,null,null,993,200,76,"TM 200","-","TM 76",0,":",1]
[null,null,null,null,null,null,994,125,124,"TM 125","-","TM 124",3,":",0]
[null,null,null,null,null,null,995,1,59,"Real Madrid","-","TM 59",1,":",5]
[null,null,null,null,null,null,996,92,58,"TM 92","-","TM 58",4,":",0]
[null,null,null,null,null,null,997,112,189,"TM 112","-","TM 189",2,":",5]
[null,null,null,null,null,null,998,130,13,"TM 130","-","Juventus Turin",3,":",1]
[null,null,null,null,null,null,999,111,197,"TM 111","-","TM 197",0,":",3]
[null,null,null,null,null,null,1000,53,52,"TM 53","-","TM 52",9,":",2]
[null,null,null,null,null,null,1001,137,190,"TM 137","-","TM 190",3,":",1]
[null,null,null,null,null,null,1002,188,191,"TM 188","-","TM 191",1,":",3]
[null,null,null,null,null,null,1003,117,116,"TM 117","-","TM 116",2,":",0]
[null,null,null,null,null,null,1004,115,17,"TM 115","-","Schachtjor Donezk",0,":",0]
[null,null,null,null,null,null,1005,18,20,"AC Mailand","-","Sporting Lissabon",3,":",0]
[null,null,null,null,null,null,1006,109,21,"TM 109","-","PSV Eindhoven",0,":",0]
[null,null,null,null,null,null,1007,23,107,"Dinamo Zagreb","-","TM 107",1,":",0]
[null,null,null,null,null,null,1008,12,31,"Atalanta Bergamo","-","FC Girona",0,":",3]
[null,null,null,null,null,null,1009,32,187,"VfB Stuttgart","-","TM 187",5,":",1]
[null,null,null,null,null,null,1010,186,33,"TM 186","-","Sturm Graz",0,":",4]
[null,null,null,null,null,null,1011,35,98,"Eintracht Frankfurt","-","TM 98",5,":",2]
[null,null,null,null,null,null,1012,185,161,"TM 185","-","TM 161",3,":",1]
[null,null,null,null,null,null,1013,138,97,"TM 138","-","TM 97",0,":",3]
[null,null,null,null,null,null,1014,120,146,"TM 120","-","TM 146",9,":",2]
[null,null,null,null,null,null,1015,47,11,"TM 47","-","Atletico Madrid",2,":",1]
[null,null,null,null,null,null,1016,184,153,"TM 184","-","TM 153",1,":",3]
[null,null,null,null,null,null,1017,42,93,"TM 42","-","TM 93",2,":",0]
[null,null,null,null,null,null,1018,94,43,"TM 94","-","TM 43",0,":",0]
[null,null,null,null,null,null,1019,177,30,"TM 177","-","FC Bologna",3,":",0]
[null,null,null,null,null,null,1020,160,150,"TM 160","-","TM 150",0,":",0]
[null,null,null,null,null,null,1021,140,106,"TM 140","-","TM 106",1,":",0]
[null,null,null,null,null,null,1022,159,126,"TM 159","-","TM 126",0,":",3]
[null,null,null,null,null,null,1023,38,148,"FC Basel","-","TM 148",5,":",1]
[null,null,null,null,null,null,1024,183,78,"TM 183","-","TM 78",0,":",4]
[null,null,null,null,null,null,1025,71,180,"TM 71","-","TM 180",5,":",2]
[null,null,null,null,null,null,1026,8,45,{"$f":"IFERROR(VLOOKUP($H1031,$B$6:$C$205,2,0),\"\")","v":"RB Leipzig"},"-",{"$f":"IFERROR(VLOOKUP($I1031,$B$6:$C$205,2,0),\"\")","v":"TM 45"},3,":",1]
[null,null,null,null,null,null,1027,199,110,"TM 199","-","TM 110",0,":",3]
[null,null,null,null,null,null,1028,89,95,"TM 89","-","TM 95",9,":",2]
[null,null,null,null,null,null,1029,166,7,"TM 166","-","Borussia Dortmund",3,":",1]
[null,null,null,null,null,null,1030,87,165,"TM 87","-","TM 165",1,":",3]
[null,null,null,null,null,null,1031,73,176,"TM 73","-","TM 176",2,":",0]
[null,null,null,null,null,null,1032,91,27,"TM 91","-","Young Boys Bern",0,":",0]
[null,null,null,null,null,null,1033,168,86,"TM 168","-","TM 86",3,":",0]
[null,null,null,null,null,null,1034,85,24,"TM 85","-","Red Bull Salzburg",0,":",0]
[null,null,null,null,null,null,1035,157,83,"TM 157","-","TM 83",1,":",0]
[null,null,null,null,null,null,1036,175,39,"TM 175","-","FC Lille",0,":",3]
[null,null,null,null,null,null,1037,192,174,"TM 192","-","TM 174",5,":",1]
[null,null,null,null,null,null,1038,10,34,"Bayer Leverkusen","-","Stade Brest",0,":",4]
[null,null,null,null,null,null,1039,129,19,"TM 129","-","Feyenoord Rotterdam",5,":",2]
[null,null,null,null,null,null,1040,77,162,"TM 77","-","TM 162",1,":",3]
[null,null,null,null,null,null,1041,147,6,"TM 147","-","Inter Mailand",3,":",1]
[null,null,null,null,null,null,1042,104,36,"TM 104","-","Mainz 05",0,":",2]
[null,null,null,null,null,null,1043,182,134,"TM 182","-","TM 134",0,":",0]
[null,null,null,null,null,null,1044,145,84,"TM 145","-","TM 84",0,":",3]
[null,null,null,null,null,null,1045,194,75,"TM 194","-","TM 75",0,":",0]
[null,null,null,null,null,null,1046,158,99,"TM 158","-","TM 99",0,":",1]
[null,null,null,null,null,null,1047,16,132,"FC Brügge","-","TM 132",3,":",0]
[null,null,null,null,null,null,1048,4,163,"Paris Saint-Germain","-","TM 163",1,":",5]
[null,null,null,null,null,null,1049,74,29,"TM 74","-","Aston Villa",4,":",0]
[null,null,null,null,null,null,1050,72,178,"TM 72","-","TM 178",2,":",5]
[null,null,null,null,null,null,1051,81,144,"TM 81","-","TM 144",1,":",3]
[null,null,null,null,null,null,1052,156,108,"TM 156","-","TM 108",3,":",0]
[null,null,null,null,null,null,1053,57,173,"TM 57","-","TM 173",2,":",9]
[null,null,null,null,null,null,1054,102,14,"TM 102","-","Benfica Lissabon",1,":",3]
[null,null,null,null,null,null,1055,68,181,"TM 68","-","TM 181",3,":",1]
[null,null,null,null,null,null,1056,3,118,"FC Bayern München","-","TM 118",0,":",2]
[null,null,null,null,null,null,1057,171,142,"TM 171","-","TM 142",0,":",0]
[null,null,null,null,null,null,1058,103,88,"TM 103","-","TM 88",0,":",3]
[null,null,null,null,null,null,1059,44,70,"TM 44","-","TM 70",0,":",0]
[null,null,null,null,null,null,1060,172,48,"TM 172","-","TM 48",0,":",1]
[null,null,null,null,null,null,1061,63,155,"TM 63","-","TM 155",3,":",0]
[null,null,null,null,null,null,1062,69,25,"TM 69","-","OSC Lille",1,":",5]
[null,null,null,null,null,null,1063,49,28,"TM 49","-","AS Monaco",4,":",0]
[null,null,null,null,null,null,1064,170,40,"TM 170","-","Hertha BSC",2,":",5]
[null,null,null,null,null,null,1065,113,152,"TM 113","-","TM 152",3,":",1]
[null,null,null,null,null,null,1066,141,46,"TM 141","-","TM 46",0,":",3]
[null,null,null,null,null,null,1067,133,167,"TM 133","-","TM 167",9,":",2]
[null,null,null,null,null,null,1068,61,5,"TM 61","-","FC Liverpool",3,":",1]
[null,null,null,null,null,null,1069,2,114,"Manchester City","-","TM 114",1,":",3]
[null,null,null,null,null,null,1070,80,66,"TM 80","-","TM 66",2,":",0]
[null,null,null,null,null,null,1071,51,135,"TM 51","-","TM 135",0,":",0]
[null,null,null,null,null,null,1072,37,151,"AC Roma","-","TM 151",3,":",0]
[null,null,null,null,null,null,1073,127,169,"TM 127","-","TM 169",0,":",0]
[null,null,null,null,null,null,1074,82,64,"TM 82","-","TM 64",1,":",0]
[null,null,null,null,null,null,1075,195,101,"TM 195","-","TM 101",0,":",3]
[null,null,null,null,null,null,1076,123,154,"TM 123","-","TM 154",5,":",1]
[null,null,null,null,null,null,1077,65,179,"TM 65","-","TM 179",0,":",4]
[null,null,null,null,null,null,1078,56,67,"TM 56","-","TM 67",5,":",2]
[null,null,null,null,null,null,1079,196,121,"TM 196","-","TM 121",3,":",1]
[null,null,null,null,null,null,1080,105,193,"TM 105","-","TM 193",0,":",3]
[null,null,null,null,null,null,1081,90,136,"TM 90","-","TM 136",9,":",2]
[null,null,null,null,null,null,1082,198,9,"TM 198","-","FC Barcelona",2,":",1]
[null,null,null,null,null,null,1083,149,15,"TM 149","-","FC Arsenal",1,":",3]
[null,null,null,null,null,null,1084,131,26,"TM 131","-","Roter Stern Belgrad",2,":",0]
[null,null,null,null,null,null,1085,143,60,"TM 143","-","TM 60",0,":",0]
[null,null,null,null,null,null,1086,62,41,"TM 62","-","TM 41",3,":",0]
[null,null,null,null,null,null,1087,128,55,"TM 128","-","TM 55",0,":",0]
[null,null,null,null,null,null,1088,122,119,"TM 122","-","TM 119",1,":",0]
[null,null,null,null,null,null,1089,50,100,"TM 50","-","TM 100",0,":",3]
[null,null,null,null,null,null,1090,164,79,{"$f":"IFERROR(VLOOKUP($H1095,$B$6:$C$205,2,0),\"\")","v":"TM 164"},"-",{"$f":"IFERROR(VLOOKUP($I1095,$B$6:$C$205,2,0),\"\")","v":"TM 79"},5,":",1]
[null,null,null,null,null,null,1091,96,54,"TM 96","-","TM 54",0,":",4]
[null,null,null,null,null,null,1092,76,22,"TM 76","-","Celtic Glasgow",5,":",2]
[null,null,null,null,null,null,1093,139,125,"TM 139","-","TM 125",3,":",1]
[null,null,null,null,null,null,1094,59,200,"TM 59","-","TM 200",0,":",3]
[null,null,null,null,null,null,1095,124,92,"TM 124","-","TM 92",9,":",2]
[null,null,null,null,null,null,1096,189,1,"TM 189","-","Real Madrid",3,":",1]
[null,null,null,null,null,null,1097,58,130,"TM 58","-","TM 130",1,":",3]
[null,null,null,null,null,null,1098,197,112,"TM 197","-","TM 112",2,":",0]
[null,null,null,null,null,null,1099,13,53,"Juventus Turin","-","TM 53",0,":",0]
[null,null,null,null,null,null,1100,52,111,"TM 52","-","TM 111",3,":",0]
[null,null,null,null,null,null,1101,188,137,"TM 188","-","TM 137",0,":",0]
[null,null,null,null,null,null,1102,116,190,"TM 116","-","TM 190",1,":",0]
[null,null,null,null,null,null,1103,191,115,"TM 191","-","TM 115",0,":",3]
[null,null,null,null,null,null,1104,20,117,"Sporting Lissabon","-","TM 117",5,":",1]
[null,null,null,null,null,null,1105,17,109,"Schachtjor Donezk","-","TM 109",0,":",4]
[null,null,null,null,null,null,1106,107,18,"TM 107","-","AC Mailand",5,":",2]
[null,null,null,null,null,null,1107,21,12,"PSV Eindhoven","-","Atalanta Bergamo",1,":",3]
[null,null,null,null,null,null,1108,187,23,"TM 187","-","Dinamo Zagreb",3,":",1]
[null,null,null,null,null,null,1109,31,186,"FC Girona","-","TM 186",0,":",2]
[null,null,null,null,null,null,1110,98,32,"TM 98","-","VfB Stuttgart",0,":",0]
[null,null,null,null,null,null,1111,33,185,"Sturm Graz","-","TM 185",0,":",3]
[null,null,null,null,null,null,1112,97,35,"TM 97","-","Eintracht Frankfurt",0,":",0]
[null,null,null,null,null,null,1113,161,120,"TM 161","-","TM 120",0,":",1]
[null,null,null,null,null,null,1114,11,138,"Atletico Madrid","-","TM 138",3,":",0]
[null,null,null,null,null,null,1115,146,184,"TM 146","-","TM 184",1,":",5]
[null,null,null,null,null,null,1116,93,47,"TM 93","-","TM 47",4,":",0]
[null,null,null,null,null,null,1117,153,94,"TM 153","-","TM 94",2,":",5]
[null,null,null,null,null,null,1118,30,42,"FC Bologna","-","TM 42",1,":",3]
[null,null,null,null,null,null,1119,43,160,"TM 43","-","TM 160",3,":",0]
[null,null,null,null,null,null,1120,106,177,"TM 106","-","TM 177",2,":",9]
[null,null,null,null,null,null,1121,150,159,"TM 150","-","TM 159",1,":",3]
[null,null,null,null,null,null,1122,148,140,"TM 148","-","TM 140",3,":",1]
[null,null,null,null,null,null,1123,126,183,"TM 126","-","TM 183",0,":",2]
[null,null,null,null,null,null,1124,180,38,"TM 180","-","FC Basel",0,":",0]
[null,null,null,null,null,null,1125,78,8,"TM 78","-","RB Leipzig",0,":",3]
[null,null,null,null,null,null,1126,110,71,"TM 110","-","TM 71",0,":",0]
[null,null,null,null,null,null,1127,45,89,"TM 45","-","TM 89",0,":",1]
[null,null,null,null,null,null,1128,7,199,"Borussia Dortmund","-","TM 199",3,":",0]
[null,null,null,null,null,null,1129,95,87,"TM 95","-","TM 87",1,":",5]
[null,null,null,null,null,null,1130,176,166,"TM 176","-","TM 166",4,":",0]
[null,null,null,null,null,null,1131,165,91,"TM 165","-","TM 91",2,":",5]
[null,null,null,null,null,null,1132,86,73,"TM 86","-","TM 73",3,":",1]
[null,null,null,null,null,null,1133,27,85,"Young Boys Bern","-","TM 85",0,":",3]
[null,null,null,null,null,null,1134,83,168,"TM 83","-","TM 168",9,":",2]
[null,null,null,null,null,null,1135,24,175,"Red Bull Salzburg","-","TM 175",3,":",1]
[null,null,null,null,null,null,1136,174,157,"TM 174","-","TM 157",1,":",3]
[null,null,null,null,null,null,1137,39,10,"FC Lille","-","Bayer Leverkusen",2,":",0]
[null,null,null,null,null,null,1138,19,192,"Feyenoord Rotterdam","-","TM 192",0,":",0]
[null,null,null,null,null,null,1139,34,77,"Stade Brest","-","TM 77",3,":",0]
[null,null,null,null,null,null,1140,6,129,"Inter Mailand","-","TM 129",0,":",0]
[null,null,null,null,null,null,1141,162,104,"TM 162","-","TM 104",1,":",0]
[null,null,null,null,null,null,1142,134,147,"TM 134","-","TM 147",0,":",3]
[null,null,null,null,null,null,1143,36,145,"Mainz 05","-","TM 145",5,":",1]
[null,null,null,null,null,null,1144,75,182,"TM 75","-","TM 182",0,":",4]
[null,null,null,null,null,null,1145,84,158,"TM 84","-","TM 158",5,":",2]
[null,null,null,null,null,null,1146,132,194,"TM 132","-","TM 194",3,":",1]
[null,null,null,null,null,null,1147,99,4,"TM 99","-","Paris Saint-Germain",0,":",3]
[null,null,null,null,null,null,1148,29,16,"Aston Villa","-","FC Brügge",9,":",2]
[null,null,null,null,null,null,1149,163,72,"TM 163","-","TM 72",2,":",1]
[null,null,null,null,null,null,1150,144,74,"TM 144","-","TM 74",1,":",3]
[null,null,null,null,null,null,1151,178,156,"TM 178","-","TM 156",2,":",0]
[null,null,null,null,null,null,1152,173,81,"TM 173","-","TM 81",0,":",0]
[null,null,null,null,null,null,1153,108,102,"TM 108","-","TM 102",3,":",0]
[null,null,null,null,null,null,1154,181,57,{"$f":"IFERROR(VLOOKUP($H1159,$B$6:$C$205,2,0),\"\")","v":"TM 181"},"-",{"$f":"IFERROR(VLOOKUP($I1159,$B$6:$C$205,2,0),\"\")","v":"TM 57"},0,":",0]
[null,null,null,null,null,null,1155,14,3,"Benfica Lissabon","-","FC Bayern München",1,":",0]
[null,null,null,null,null,null,1156,142,68,"TM 142","-","TM 68",0,":",3]
[null,null,null,null,null,null,1157,118,103,"TM 118","-","TM 103",5,":",1]
[null,null,null,null,null,null,1158,70,171,"TM 70","-","TM 171",0,":",4]
[null,null,null,null,null,null,1159,88,172,"TM 88","-","TM 172",5,":",2]
[null,null,null,null,null,null,1160,155,44,"TM 155","-","TM 44",3,":",1]
[null,null,null,null,null,null,1161,48,69,"TM 48","-","TM 69",0,":",3]
[null,null,null,null,null,null,1162,28,63,"AS Monaco","-","TM 63",9,":",2]
[null,null,null,null,null,null,1163,25,170,"OSC Lille","-","TM 170",3,":",1]
[null,null,null,null,null,null,1164,152,49,"TM 152","-","TM 49",1,":",3]
[null,null,null,null,null,null,1165,40,141,"Hertha BSC","-","TM 141",2,":",0]
[null,null,null,null,null,null,1166,167,113,"TM 167","-","TM 113",0,":",0]
[null,null,null,null,null,null,1167,46,61,"TM 46","-","TM 61",3,":",0]
[null,null,null,null,null,null,1168,114,133,"TM 114","-","TM 133",0,":",0]
[null,null,null,null,null,null,1169,5,80,"FC Liverpool","-","TM 80",1,":",0]
[null,null,null,null,null,null,1170,135,2,"TM 135","-","Manchester City",0,":",3]
[null,null,null,null,null,null,1171,66,37,"TM 66","-","AC Roma",5,":",1]
[null,null,null,null,null,null,1172,169,51,"TM 169","-","TM 51",0,":",4]
[null,null,null,null,null,null,1173,151,82,"TM 151","-","TM 82",5,":",2]
[null,null,null,null,null,null,1174,101,127,"TM 101","-","TM 127",1,":",3]
[null,null,null,null,null,null,1175,64,123,"TM 64","-","TM 123",3,":",1]
[null,null,null,null,null,null,1176,179,195,"TM 179","-","TM 195",0,":",2]
[null,null,null,null,null,null,1177,154,56,"TM 154","-","TM 56",0,":",0]
[null,null,null,null,null,null,1178,121,65,"TM 121","-","TM 65",0,":",3]
[null,null,null,null,null,null,1179,67,105,"TM 67","-","TM 105",0,":",0]
[null,null,null,null,null,null,1180,136,196,"TM 136","-","TM 196",0,":",1]
[null,null,null,null,null,null,1181,193,198,"TM 193","-","TM 198",3,":",0]
[null,null,null,null,null,null,1182,15,90,"FC Arsenal","-","TM 90",1,":",5]
[null,null,null,null,null,null,1183,9,131,"FC Barcelona","-","TM 131",4,":",0]
[null,null,null,null,null,null,1184,60,149,"TM 60","-","TM 149",2,":",5]
[null,null,null,null,null,null,1185,26,62,"Roter Stern Belgrad","-","TM 62",1,":",3]
[null,null,null,null,null,null,1186,55,143,"TM 55","-","TM 143",3,":",0]
[null,null,null,null,null,null,1187,41,122,"TM 41","-","TM 122",2,":",9]
[null,null,null,null,null,null,1188,100,128,"TM 100","-","TM 128",1,":",3]
[null,null,null,null,null,null,1189,119,164,"TM 119","-","TM 164",3,":",1]
[null,null,null,null,null,null,1190,54,50,"TM 54","-","TM 50",0,":",2]
[null,null,null,null,null,null,1191,79,76,"TM 79","-","TM 76",0,":",0]
[null,null,null,null,null,null,1192,125,96,"TM 125","-","TM 96",0,":",3]
[null,null,null,null,null,null,1193,22,59,"Celtic Glasgow","-","TM 59",0,":",0]
[null,null,null,null,null,null,1194,92,139,"TM 92","-","TM 139",0,":",1]
[null,null,null,null,null,null,1195,200,189,"TM 200","-","TM 189",3,":",0]
[null,null,null,null,null,null,1196,130,124,"TM 130","-","TM 124",1,":",5]
[null,null,null,null,null,null,1197,1,197,"Real Madrid","-","TM 197",4,":",0]
[null,null,null,null,null,null,1198,53,58,"TM 53","-","TM 58",2,":",5]
[null,null,null,null,null,null,1199,112,52,"TM 112","-","TM 52",3,":",1]
[null,null,null,null,null,null,1200,111,13,"TM 111","-","Juventus Turin",0,":",3]
[null,null,null,null,null,null,1201,137,116,"TM 137","-","TM 116",9,":",2]
[null,null,null,null,null,null,1202,115,188,"TM 115","-","TM 188",3,":",1]
[null,null,null,null,null,null,1203,190,20,"TM 190","-","Sporting Lissabon",1,":",3]
[null,null,null,null,null,null,1204,109,191,"TM 109","-","TM 191",2,":",0]
[null,null,null,null,null,null,1205,117,107,"TM 117","-","TM 107",0,":",0]
[null,null,null,null,null,null,1206,12,17,"Atalanta Bergamo","-","Schachtjor Donezk",3,":",0]
[null,null,null,null,null,null,1207,18,187,"AC Mailand","-","TM 187",0,":",0]
[null,null,null,null,null,null,1208,186,21,"TM 186","-","PSV Eindhoven",1,":",0]
[null,null,null,null,null,null,1209,23,98,"Dinamo Zagreb","-","TM 98",0,":",3]
[null,null,null,null,null,null,1210,185,31,"TM 185","-","FC Girona",5,":",1]
[null,null,null,null,null,null,1211,32,97,"VfB Stuttgart","-","TM 97",0,":",4]
[null,null,null,null,null,null,1212,120,33,"TM 120","-","Sturm Graz",5,":",2]
[null,null,null,null,null,null,1213,35,11,"Eintracht Frankfurt","-","Atletico Madrid",3,":",1]
[null,null,null,null,null,null,1214,184,161,"TM 184","-","TM 161",0,":",3]
[null,null,null,null,null,null,1215,138,93,"TM 138","-","TM 93",9,":",2]
[null,null,null,null,null,null,1216,94,146,"TM 94","-","TM 146",2,":",1]
[null,null,null,null,null,null,1217,47,30,"TM 47","-","FC Bologna",1,":",3]
[null,null,null,null,null,null,1218,160,153,{"$f":"IFERROR(VLOOKUP($H1223,$B$6:$C$205,2,0),\"\")","v":"TM 160"},"-",{"$f":"IFERROR(VLOOKUP($I1223,$B$6:$C$205,2,0),\"\")","v":"TM 153"},2,":",0]
[null,null,null,null,null,null,1219,42,106,"TM 42","-","TM 106",0,":",0]
[null,null,null,null,null,null,1220,159,43,"TM 159","-","TM 43",3,":",0]
[null,null,null,null,null,null,1221,177,148,"TM 177","-","TM 148",0,":",0]
[null,null,null,null,null,null,1222,183,150,"TM 183","-","TM 150",1,":",0]
[null,null,null,null,null,null,1223,140,180,"TM 140","-","TM 180",0,":",3]
[null,null,null,null,null,null,1224,8,126,"RB Leipzig","-","TM 126",5,":",1]
[null,null,null,null,null,null,1225,38,110,"FC Basel","-","TM 110",0,":",4]
[null,null,null,null,null,null,1226,89,78,"TM 89","-","TM 78",5,":",2]
[null,null,null,null,null,null,1227,71,7,"TM 71","-","Borussia Dortmund",3,":",1]
[null,null,null,null,null,null,1228,87,45,"TM 87","-","TM 45",0,":",3]
[null,null,null,null,null,null,1229,199,176,"TM 199","-","TM 176",9,":",2]
[null,null,null,null,null,null,1230,91,95,"TM 91","-","TM 95",3,":",1]
[null,null,null,null,null,null,1231,166,86,"TM 166","-","TM 86",1,":",3]
[null,null,null,null,null,null,1232,85,165,"TM 85","-","TM 165",2,":",0]
[null,null,null,null,null,null,1233,73,83,"TM 73","-","TM 83",0,":",0]
[null,null,null,null,null,null,1234,175,27,"TM 175","-","Young Boys Bern",3,":",0]
[null,null,null,null,null,null,1235,168,174,"TM 168","-","TM 174",0,":",0]
[null,null,null,null,null,null,1236,10,24,"Bayer Leverkusen","-","Red Bull Salzburg",1,":",0]
[null,null,null,null,null,null,1237,157,19,"TM 157","-","Feyenoord Rotterdam",0,":",3]
[null,null,null,null,null,null,1238,77,39,"TM 77","-","FC Lille",5,":",1]
[null,null,null,null,null,null,1239,192,6,"TM 192","-","Inter Mailand",0,":",4]
[null,null,null,null,null,null,1240,104,34,"TM 104","-","Stade Brest",5,":",2]
[null,null,null,null,null,null,1241,129,134,"TM 129","-","TM 134",1,":",3]
[null,null,null,null,null,null,1242,145,162,"TM 145","-","TM 162",3,":",1]
[null,null,null,null,null,null,1243,147,75,"TM 147","-","TM 75",0,":",2]
[null,null,null,null,null,null,1244,158,36,"TM 158","-","Mainz 05",0,":",0]
[null,null,null,null,null,null,1245,182,132,"TM 182","-","TM 132",0,":",3]
[null,null,null,null,null,null,1246,4,84,"Paris Saint-Germain","-","TM 84",0,":",0]
[null,null,null,null,null,null,1247,194,29,"TM 194","-","Aston Villa",0,":",1]
[null,null,null,null,null,null,1248,72,99,"TM 72","-","TM 99",3,":",0]
[null,null,null,null,null,null,1249,16,144,"FC Brügge","-","TM 144",1,":",5]
[null,null,null,null,null,null,1250,156,163,"TM 156","-","TM 163",4,":",0]
[null,null,null,null,null,null,1251,74,173,"TM 74","-","TM 173",2,":",5]
[null,null,null,null,null,null,1252,102,178,"TM 102","-","TM 178",1,":",3]
[null,null,null,null,null,null,1253,81,181,"TM 81","-","TM 181",3,":",0]
[null,null,null,null,null,null,1254,3,108,"FC Bayern München","-","TM 108",2,":",9]
[null,null,null,null,null,null,1255,57,142,"TM 57","-","TM 142",1,":",3]
[null,null,null,null,null,null,1256,103,14,"TM 103","-","Benfica Lissabon",3,":",1]
[null,null,null,null,null,null,1257,68,70,"TM 68","-","TM 70",0,":",2]
[null,null,null,null,null,null,1258,172,118,"TM 172","-","TM 118",0,":",0]
[null,null,null,null,null,null,1259,171,155,"TM 171","-","TM 155",0,":",3]
[null,null,null,null,null,null,1260,69,88,"TM 69","-","TM 88",0,":",0]
[null,null,null,null,null,null,1261,44,28,"TM 44","-","AS Monaco",0,":",1]
[null,null,null,null,null,null,1262,170,48,"TM 170","-","TM 48",3,":",0]
[null,null,null,null,null,null,1263,63,152,"TM 63","-","TM 152",1,":",5]
[null,null,null,null,null,null,1264,141,25,"TM 141","-","OSC Lille",4,":",0]
[null,null,null,null,null,null,1265,49,167,"TM 49","-","TM 167",2,":",5]
[null,null,null,null,null,null,1266,61,40,"TM 61","-","Hertha BSC",3,":",1]
[null,null,null,null,null,null,1267,113,114,"TM 113","-","TM 114",0,":",3]
[null,null,null,null,null,null,1268,80,46,"TM 80","-","TM 46",9,":",2]
[null,null,null,null,null,null,1269,133,135,"TM 133","-","TM 135",3,":",1]
[null,null,null,null,null,null,1270,37,5,"AC Roma","-","FC Liverpool",1,":",3]
[null,null,null,null,null,null,1271,2,169,"Manchester City","-","TM 169",2,":",0]
[null,null,null,null,null,null,1272,82,66,"TM 82","-","TM 66",0,":",0]
[null,null,null,null,null,null,1273,51,101,"TM 51","-","TM 101",3,":",0]
[null,null,null,null,null,null,1274,123,151,"TM 123","-","TM 151",0,":",0]
[null,null,null,null,null,null,1275,127,179,"TM 127","-","TM 179",1,":",0]
[null,null,null,null,null,null,1276,56,64,"TM 56","-","TM 64",0,":",3]
[null,null,null,null,null,null,1277,195,121,"TM 195","-","TM 121",5,":",1]
[null,null,null,null,null,null,1278,105,154,"TM 105","-","TM 154",0,":",4]
[null,null,null,null,null,null,1279,65,136,"TM 65","-","TM 136",5,":",2]
[null,null,null,null,null,null,1280,198,67,"TM 198","-","TM 67",3,":",1]
[null,null,null,null,null,null,1281,196,15,"TM 196","-","FC Arsenal",0,":",3]
[null,null,null,null,null,null,1282,131,193,{"$f":"IFERROR(VLOOKUP($H1287,$B$6:$C$205,2,0),\"\")","v":"TM 131"},"-",{"$f":"IFERROR(VLOOKUP($I1287,$B$6:$C$205,2,0),\"\")","v":"TM 193"},9,":",2]
[null,null,null,null,null,null,1283,90,60,"TM 90","-","TM 60",2,":",1]
[null,null,null,null,null,null,1284,62,9,"TM 62","-","FC Barcelona",1,":",3]
[null,null,null,null,null,null,1285,149,55,"TM 149","-","TM 55",2,":",0]
[null,null,null,null,null,null,1286,122,26,"TM 122","-","Roter Stern Belgrad",0,":",0]
[null,null,null,null,null,null,1287,143,100,"TM 143","-","TM 100",3,":",0]
[null,null,null,null,null,null,1288,164,41,"TM 164","-","TM 41",0,":",0]
[null,null,null,null,null,null,1289,128,54,"TM 128","-","TM 54",1,":",0]
[null,null,null,null,null,null,1290,76,119,"TM 76","-","TM 119",0,":",3]
[null,null,null,null,null,null,1291,50,125,"TM 50","-","TM 125",5,":",1]
[null,null,null,null,null,null,1292,59,79,"TM 59","-","TM 79",0,":",4]
[null,null,null,null,null,null,1293,96,92,"TM 96","-","TM 92",5,":",2]
[null,null,null,null,null,null,1294,189,22,"TM 189","-","Celtic Glasgow",3,":",1]
[null,null,null,null,null,null,1295,139,130,"TM 139","-","TM 130",0,":",3]
[null,null,null,null,null,null,1296,197,200,"TM 197","-","TM 200",9,":",2]
[null,null,null,null,null,null,1297,124,53,"TM 124","-","TM 53",3,":",1]
[null,null,null,null,null,null,1298,52,1,"TM 52","-","Real Madrid",1,":",3]
[null,null,null,null,null,null,1299,58,111,"TM 58","-","TM 111",2,":",0]
[null,null,null,null,null,null,1300,13,112,"Juventus Turin","-","TM 112",0,":",0]
[null,null,null,null,null,null,1301,115,137,"TM 115","-","TM 137",3,":",0]
[null,null,null,null,null,null,1302,20,116,"Sporting Lissabon","-","TM 116",0,":",0]
[null,null,null,null,null,null,1303,188,109,"TM 188","-","TM 109",1,":",0]
[null,null,null,null,null,null,1304,107,190,"TM 107","-","TM 190",0,":",3]
[null,null,null,null,null,null,1305,191,12,"TM 191","-","Atalanta Bergamo",5,":",1]
[null,null,null,null,null,null,1306,187,117,"TM 187","-","TM 117",0,":",4]
[null,null,null,null,null,null,1307,17,186,"Schachtjor Donezk","-","TM 186",5,":",2]
[null,null,null,null,null,null,1308,98,18,"TM 98","-","AC Mailand",1,":",3]
[null,null,null,null,null,null,1309,21,185,"PSV Eindhoven","-","TM 185",3,":",1]
[null,null,null,null,null,null,1310,97,23,"TM 97","-","Dinamo Zagreb",0,":",2]
[null,null,null,null,null,null,1311,31,120,"FC Girona","-","TM 120",0,":",0]
[null,null,null,null,null,null,1312,11,32,"Atletico Madrid","-","VfB Stuttgart",0,":",3]
[null,null,null,null,null,null,1313,33,184,"Sturm Graz","-","TM 184",0,":",0]
[null,null,null,null,null,null,1314,93,35,"TM 93","-","Eintracht Frankfurt",0,":",1]
[null,null,null,null,null,null,1315,161,94,"TM 161","-","TM 94",3,":",0]
[null,null,null,null,null,null,1316,30,138,"FC Bologna","-","TM 138",1,":",5]
[null,null,null,null,null,null,1317,146,160,"TM 146","-","TM 160",4,":",0]
[null,null,null,null,null,null,1318,106,47,"TM 106","-","TM 47",2,":",5]
[null,null,null,null,null,null,1319,153,159,"TM 153","-","TM 159",1,":",3]
[null,null,null,null,null,null,1320,148,42,"TM 148","-","TM 42",3,":",0]
[null,null,null,null,null,null,1321,43,183,"TM 43","-","TM 183",2,":",9]
[null,null,null,null,null,null,1322,180,177,"TM 180","-","TM 177",1,":",3]
[null,null,null,null,null,null,1323,150,8,"TM 150","-","RB Leipzig",3,":",1]
[null,null,null,null,null,null,1324,110,140,"TM 110","-","TM 140",0,":",2]
[null,null,null,null,null,null,1325,126,89,"TM 126","-","TM 89",0,":",0]
[null,null,null,null,null,null,1326,7,38,"Borussia Dortmund","-","FC Basel",0,":",3]
[null,null,null,null,null,null,1327,78,87,"TM 78","-","TM 87",0,":",0]
[null,null,null,null,null,null,1328,176,71,"TM 176","-","TM 71",0,":",1]
[null,null,null,null,null,null,1329,45,91,"TM 45","-","TM 91",3,":",0]
[null,null,null,null,null,null,1330,86,199,"TM 86","-","TM 199",1,":",5]
[null,null,null,null,null,null,1331,95,85,"TM 95","-","TM 85",4,":",0]
[null,null,null,null,null,null,1332,83,166,"TM 83","-","TM 166",2,":",5]
[null,null,null,null,null,null,1333,165,175,"TM 165","-","TM 175",3,":",1]
[null,null,null,null,null,null,1334,174,73,"TM 174","-","TM 73",0,":",3]
[null,null,null,null,null,null,1335,27,10,"Young Boys Bern","-","Bayer Leverkusen",9,":",2]
[null,null,null,null,null,null,1336,19,168,"Feyenoord Rotterdam","-","TM 168",3,":",1]
[null,null,null,null,null,null,1337,24,77,"Red Bull Salzburg","-","TM 77",1,":",3]
[null,null,null,null,null,null,1338,6,157,"Inter Mailand","-","TM 157",2,":",0]
[null,null,null,null,null,null,1339,39,104,"FC Lille","-","TM 104",0,":",0]
[null,null,null,null,null,null,1340,134,192,"TM 134","-","TM 192",3,":",0]
[null,null,null,null,null,null,1341,34,145,"Stade Brest","-","TM 145",0,":",0]
[null,null,null,null,null,null,1342,75,129,"TM 75","-","TM 129",1,":",0]
[null,null,null,null,null,null,1343,162,158,"TM 162","-","TM 158",0,":",3]
[null,null,null,null,null,null,1344,132,147,"TM 132","-","TM 147",5,":",1]
[null,null,null,null,null,null,1345,36,4,"Mainz 05","-","Paris Saint-Germain",0,":",4]
[null,null,null,null,null,null,1346,29,182,{"$f":"IFERROR(VLOOKUP($H1351,$B$6:$C$205,2,0),\"\")","v":"Aston Villa"},"-",{"$f":"IFERROR(VLOOKUP($I1351,$B$6:$C$205,2,0),\"\")","v":"TM 182"},5,":",2]
[null,null,null,null,null,null,1347,84,72,"TM 84","-","TM 72",3,":",1]
[null,null,null,null,null,null,1348,144,194,"TM 144","-","TM 194",0,":",3]
[null,null,null,null,null,null,1349,99,156,"TM 99","-","TM 156",9,":",2]
[null,null,null,null,null,null,1350,173,16,"TM 173","-","FC Brügge",2,":",1]
[null,null,null,null,null,null,1351,163,102,"TM 163","-","TM 102",1,":",3]
[null,null,null,null,null,null,1352,181,74,"TM 181","-","TM 74",2,":",0]
[null,null,null,null,null,null,1353,178,3,"TM 178","-","FC Bayern München",0,":",0]
[null,null,null,null,null,null,1354,142,81,"TM 142","-","TM 81",3,":",0]
[null,null,null,null,null,null,1355,108,103,"TM 108","-","TM 103",0,":",0]
[null,null,null,null,null,null,1356,70,57,"TM 70","-","TM 57",1,":",0]
[null,null,null,null,null,null,1357,14,172,"Benfica Lissabon","-","TM 172",0,":",3]
[null,null,null,null,null,null,1358,155,68,"TM 155","-","TM 68",5,":",1]
[null,null,null,null,null,null,1359,118,69,"TM 118","-","TM 69",0,":",4]
[null,null,null,null,null,null,1360,28,171,"AS Monaco","-","TM 171",5,":",2]
[null,null,null,null,null,null,1361,88,170,"TM 88","-","TM 170",3,":",1]
[null,null,null,null,null,null,1362,152,44,"TM 152","-","TM 44",0,":",3]
[null,null,null,null,null,null,1363,48,141,"TM 48","-","TM 141",9,":",2]
[null,null,null,null,null,null,1364,167,63,"TM 167","-","TM 63",3,":",1]
[null,null,null,null,null,null,1365,25,61,"OSC Lille","-","TM 61",1,":",3]
[null,null,null,null,null,null,1366,114,49,"TM 114","-","TM 49",2,":",0]
[null,null,null,null,null,null,1367,40,80,"Hertha BSC","-","TM 80",0,":",0]
[null,null,null,null,null,null,1368,135,113,"TM 135","-","TM 113",3,":",0]
[null,null,null,null,null,null,1369,46,37,"TM 46","-","AC Roma",0,":",0]
[null,null,null,null,null,null,1370,169,133,"TM 169","-","TM 133",1,":",0]
[null,null,null,null,null,null,1371,5,82,"FC Liverpool","-","TM 82",0,":",3]
[null,null,null,null,null,null,1372,101,2,"TM 101","-","Manchester City",5,":",1]
[null,null,null,null,null,null,1373,66,123,"TM 66","-","TM 123",0,":",4]
[null,null,null,null,null,null,1374,179,51,"TM 179","-","TM 51",5,":",2]
[null,null,null,null,null,null,1375,151,56,"TM 151","-","TM 56",1,":",3]
[null,null,null,null,null,null,1376,121,127,"TM 121","-","TM 127",3,":",1]
[null,null,null,null,null,null,1377,64,105,"TM 64","-","TM 105",0,":",2]
[null,null,null,null,null,null,1378,136,195,"TM 136","-","TM 195",0,":",0]
[null,null,null,null,null,null,1379,154,198,"TM 154","-","TM 198",0,":",3]
[null,null,null,null,null,null,1380,15,65,"FC Arsenal","-","TM 65",0,":",0]
[null,null,null,null,null,null,1381,67,131,"TM 67","-","TM 131",0,":",1]
[null,null,null,null,null,null,1382,60,196,"TM 60","-","TM 196",3,":",0]
[null,null,null,null,null,null,1383,193,62,"TM 193","-","TM 62",1,":",5]
[null,null,null,null,null,null,1384,55,90,"TM 55","-","TM 90",4,":",0]
[null,null,null,null,null,null,1385,9,122,"FC Barcelona","-","TM 122",2,":",5]
[null,null,null,null,null,null,1386,100,149,"TM 100","-","TM 149",1,":",3]
[null,null,null,null,null,null,1387,26,164,"Roter Stern Belgrad","-","TM 164",3,":",0]
[null,null,null,null,null,null,1388,54,143,"TM 54","-","TM 143",2,":",9]
[null,null,null,null,null,null,1389,41,76,"TM 41","-","TM 76",1,":",3]
[null,null,null,null,null,null,1390,125,128,"TM 125","-","TM 128",3,":",1]
[null,null,null,null,null,null,1391,119,59,"TM 119","-","TM 59",0,":",2]
[null,null,null,null,null,null,1392,92,50,"TM 92","-","TM 50",0,":",0]
[null,null,null,null,null,null,1393,79,189,"TM 79","-","TM 189",0,":",3]
[null,null,null,null,null,null,1394,130,96,"TM 130","-","TM 96",0,":",0]
[null,null,null,null,null,null,1395,22,197,"Celtic Glasgow","-","TM 197",0,":",1]
[null,null,null,null,null,null,1396,53,139,"TM 53","-","TM 139",3,":",0]
[null,null,null,null,null,null,1397,200,52,"TM 200","-","TM 52",1,":",5]
[null,null,null,null,null,null,1398,111,124,"TM 111","-","TM 124",4,":",0]
[null,null,null,null,null,null,1399,1,13,"Real Madrid","-","Juventus Turin",2,":",5]
[null,null,null,null,null,null,1400,112,58,"TM 112","-","TM 58",3,":",1]
[null,null,null,null,null,null,1401,137,20,"TM 137","-","Sporting Lissabon",0,":",3]
[null,null,null,null,null,null,1402,109,115,"TM 109","-","TM 115",9,":",2]
[null,null,null,null,null,null,1403,116,107,"TM 116","-","TM 107",3,":",1]
[null,null,null,null,null,null,1404,12,188,"Atalanta Bergamo","-","TM 188",1,":",3]
[null,null,null,null,null,null,1405,190,187,"TM 190","-","TM 187",2,":",0]
[null,null,null,null,null,null,1406,186,191,"TM 186","-","TM 191",0,":",0]
[null,null,null,null,null,null,1407,117,98,"TM 117","-","TM 98",3,":",0]
[null,null,null,null,null,null,1408,185,17,"TM 185","-","Schachtjor Donezk",0,":",0]
[null,null,null,null,null,null,1409,18,97,"AC Mailand","-","TM 97",1,":",0]
[null,null,null,null,null,null,1410,120,21,{"$f":"IFERROR(VLOOKUP($H1415,$B$6:$C$205,2,0),\"\")","v":"TM 120"},"-",{"$f":"IFERROR(VLOOKUP($I1415,$B$6:$C$205,2,0),\"\")","v":"PSV Eindhoven"},0,":",3]
[null,null,null,null,null,null,1411,23,11,"Dinamo Zagreb","-","Atletico Madrid",5,":",1]
[null,null,null,null,null,null,1412,184,31,"TM 184","-","FC Girona",0,":",4]
[null,null,null,null,null,null,1413,32,93,"VfB Stuttgart","-","TM 93",5,":",2]
[null,null,null,null,null,null,1414,94,33,"TM 94","-","Sturm Graz",3,":",1]
[null,null,null,null,null,null,1415,35,30,"Eintracht Frankfurt","-","FC Bologna",0,":",3]
[null,null,null,null,null,null,1416,160,161,"TM 160","-","TM 161",9,":",2]
[null,null,null,null,null,null,1417,138,106,"TM 138","-","TM 106",2,":",1]
[null,null,null,null,null,null,1418,159,146,"TM 159","-","TM 146",1,":",3]
[null,null,null,null,null,null,1419,47,148,"TM 47","-","TM 148",2,":",0]
[null,null,null,null,null,null,1420,183,153,"TM 183","-","TM 153",0,":",0]
[null,null,null,null,null,null,1421,42,180,"TM 42","-","TM 180",3,":",0]
[null,null,null,null,null,null,1422,8,43,"RB Leipzig","-","TM 43",0,":",0]
[null,null,null,null,null,null,1423,177,110,"TM 177","-","TM 110",1,":",0]
[null,null,null,null,null,null,1424,89,150,"TM 89","-","TM 150",0,":",3]
[null,null,null,null,null,null,1425,140,7,"TM 140","-","Borussia Dortmund",5,":",1]
[null,null,null,null,null,null,1426,87,126,"TM 87","-","TM 126",0,":",4]
[null,null,null,null,null,null,1427,38,176,"FC Basel","-","TM 176",5,":",2]
[null,null,null,null,null,null,1428,91,78,"TM 91","-","TM 78",3,":",1]
[null,null,null,null,null,null,1429,71,86,"TM 71","-","TM 86",0,":",3]
[null,null,null,null,null,null,1430,85,45,"TM 85","-","TM 45",9,":",2]
[null,null,null,null,null,null,1431,199,83,"TM 199","-","TM 83",3,":",1]
[null,null,null,null,null,null,1432,175,95,"TM 175","-","TM 95",1,":",3]
[null,null,null,null,null,null,1433,166,174,"TM 166","-","TM 174",2,":",0]
[null,null,null,null,null,null,1434,10,165,"Bayer Leverkusen","-","TM 165",0,":",0]
[null,null,null,null,null,null,1435,73,19,"TM 73","-","Feyenoord Rotterdam",3,":",0]
[null,null,null,null,null,null,1436,77,27,"TM 77","-","Young Boys Bern",0,":",0]
[null,null,null,null,null,null,1437,168,6,"TM 168","-","Inter Mailand",1,":",0]
[null,null,null,null,null,null,1438,104,24,"TM 104","-","Red Bull Salzburg",0,":",3]
[null,null,null,null,null,null,1439,157,134,"TM 157","-","TM 134",5,":",1]
[null,null,null,null,null,null,1440,145,39,"TM 145","-","FC Lille",0,":",4]
[null,null,null,null,null,null,1441,192,75,"TM 192","-","TM 75",5,":",2]
[null,null,null,null,null,null,1442,158,34,"TM 158","-","Stade Brest",1,":",3]
[null,null,null,null,null,null,1443,129,132,"TM 129","-","TM 132",3,":",1]
[null,null,null,null,null,null,1444,4,162,"Paris Saint-Germain","-","TM 162",0,":",2]
[null,null,null,null,null,null,1445,147,29,"TM 147","-","Aston Villa",0,":",0]
[null,null,null,null,null,null,1446,72,36,"TM 72","-","Mainz 05",0,":",3]
[null,null,null,null,null,null,1447,182,144,"TM 182","-","TM 144",0,":",0]
[null,null,null,null,null,null,1448,156,84,"TM 156","-","TM 84",0,":",1]
[null,null,null,null,null,null,1449,194,173,"TM 194","-","TM 173",3,":",0]
[null,null,null,null,null,null,1450,102,99,"TM 102","-","TM 99",1,":",5]
[null,null,null,null,null,null,1451,16,181,"FC Brügge","-","TM 181",4,":",0]
[null,null,null,null,null,null,1452,3,163,"FC Bayern München","-","TM 163",2,":",5]
[null,null,null,null,null,null,1453,74,142,"TM 74","-","TM 142",1,":",3]
[null,null,null,null,null,null,1454,103,178,"TM 103","-","TM 178",3,":",0]
[null,null,null,null,null,null,1455,81,70,"TM 81","-","TM 70",2,":",9]
[null,null,null,null,null,null,1456,172,108,"TM 172","-","TM 108",1,":",3]
[null,null,null,null,null,null,1457,57,155,"TM 57","-","TM 155",3,":",1]
[null,null,null,null,null,null,1458,69,14,"TM 69","-","Benfica Lissabon",0,":",2]
[null,null,null,null,null,null,1459,68,28,"TM 68","-","AS Monaco",0,":",0]
[null,null,null,null,null,null,1460,170,118,"TM 170","-","TM 118",0,":",3]
[null,null,null,null,null,null,1461,171,152,"TM 171","-","TM 152",0,":",0]
[null,null,null,null,null,null,1462,141,88,"TM 141","-","TM 88",0,":",1]
[null,null,null,null,null,null,1463,44,167,"TM 44","-","TM 167",3,":",0]
[null,null,null,null,null,null,1464,61,48,"TM 61","-","TM 48",1,":",5]
[null,null,null,null,null,null,1465,63,114,"TM 63","-","TM 114",4,":",0]
[null,null,null,null,null,null,1466,80,25,"TM 80","-","OSC Lille",2,":",5]
[null,null,null,null,null,null,1467,49,135,"TM 49","-","TM 135",3,":",1]
[null,null,null,null,null,null,1468,37,40,"AC Roma","-","Hertha BSC",0,":",3]
[null,null,null,null,null,null,1469,113,169,"TM 113","-","TM 169",9,":",2]
[null,null,null,null,null,null,1470,82,46,"TM 82","-","TM 46",3,":",1]
[null,null,null,null,null,null,1471,133,101,"TM 133","-","TM 101",1,":",3]
[null,null,null,null,null,null,1472,123,5,"TM 123","-","FC Liverpool",2,":",0]
[null,null,null,null,null,null,1473,2,179,"Manchester City","-","TM 179",0,":",0]
[null,null,null,null,null,null,1474,56,66,{"$f":"IFERROR(VLOOKUP($H1479,$B$6:$C$205,2,0),\"\")","v":"TM 56"},"-",{"$f":"IFERROR(VLOOKUP($I1479,$B$6:$C$205,2,0),\"\")","v":"TM 66"},3,":",0]
[null,null,null,null,null,null,1475,51,121,"TM 51","-","TM 121",0,":",0]
[null,null,null,null,null,null,1476,105,151,"TM 105","-","TM 151",1,":",0]
[null,null,null,null,null,null,1477,127,136,"TM 127","-","TM 136",0,":",3]
[null,null,null,null,null,null,1478,198,64,"TM 198","-","TM 64",5,":",1]
[null,null,null,null,null,null,1479,195,15,"TM 195","-","FC Arsenal",0,":",4]
[null,null,null,null,null,null,1480,131,154,"TM 131","-","TM 154",5,":",2]
[null,null,null,null,null,null,1481,65,60,"TM 65","-","TM 60",3,":",1]
[null,null,null,null,null,null,1482,62,67,"TM 62","-","TM 67",0,":",3]
[null,null,null,null,null,null,1483,196,55,"TM 196","-","TM 55",9,":",2]
[null,null,null,null,null,null,1484,122,193,"TM 122","-","TM 193",2,":",1]
[null,null,null,null,null,null,1485,90,100,"TM 90","-","TM 100",1,":",3]
[null,null,null,null,null,null,1486,164,9,"TM 164","-","FC Barcelona",2,":",0]
[null,null,null,null,null,null,1487,149,54,"TM 149","-","TM 54",0,":",0]
[null,null,null,null,null,null,1488,76,26,"TM 76","-","Roter Stern Belgrad",3,":",0]
[null,null,null,null,null,null,1489,143,125,"TM 143","-","TM 125",0,":",0]
[null,null,null,null,null,null,1490,59,41,"TM 59","-","TM 41",1,":",0]
[null,null,null,null,null,null,1491,128,92,"TM 128","-","TM 92",0,":",3]
[null,null,null,null,null,null,1492,189,119,"TM 189","-","TM 119",5,":",1]
[null,null,null,null,null,null,1493,50,130,"TM 50","-","TM 130",0,":",4]
[null,null,null,null,null,null,1494,197,79,"TM 197","-","TM 79",5,":",2]
[null,null,null,null,null,null,1495,96,53,"TM 96","-","TM 53",3,":",1]
[null,null,null,null,null,null,1496,52,22,"TM 52","-","Celtic Glasgow",0,":",3]
[null,null,null,null,null,null,1497,139,111,"TM 139","-","TM 111",9,":",2]
[null,null,null,null,null,null,1498,13,200,"Juventus Turin","-","TM 200",3,":",1]
[null,null,null,null,null,null,1499,124,112,"TM 124","-","TM 112",1,":",3]
[null,null,null,null,null,null,1500,58,1,"TM 58","-","Real Madrid",2,":",0]
[null,null,null,null,null,null,1501,109,137,"TM 109","-","TM 137",0,":",0]
[null,null,null,null,null,null,1502,107,20,"TM 107","-","Sporting Lissabon",3,":",0]
[null,null,null,null,null,null,1503,115,12,"TM 115","-","Atalanta Bergamo",0,":",0]
[null,null,null,null,null,null,1504,187,116,"TM 187","-","TM 116",1,":",0]
[null,null,null,null,null,null,1505,188,186,"TM 188","-","TM 186",0,":",3]
[null,null,null,null,null,null,1506,98,190,"TM 98","-","TM 190",5,":",1]
[null,null,null,null,null,null,1507,191,185,"TM 191","-","TM 185",0,":",4]
[null,null,null,null,null,null,1508,97,117,"TM 97","-","TM 117",5,":",2]
[null,null,null,null,null,null,1509,17,120,"Schachtjor Donezk","-","TM 120",1,":",3]
[null,null,null,null,null,null,1510,11,18,"Atletico Madrid","-","AC Mailand",3,":",1]
[null,null,null,null,null,null,1511,21,184,"PSV Eindhoven","-","TM 184",0,":",2]
[null,null,null,null,null,null,1512,93,23,"TM 93","-","Dinamo Zagreb",0,":",0]
[null,null,null,null,null,null,1513,31,94,"FC Girona","-","TM 94",0,":",3]
[null,null,null,null,null,null,1514,30,32,"FC Bologna","-","VfB Stuttgart",0,":",0]
[null,null,null,null,null,null,1515,33,160,"Sturm Graz","-","TM 160",0,":",1]
[null,null,null,null,null,null,1516,106,35,"TM 106","-","Eintracht Frankfurt",3,":",0]
[null,null,null,null,null,null,1517,161,159,"TM 161","-","TM 159",1,":",5]
[null,null,null,null,null,null,1518,148,138,"TM 148","-","TM 138",4,":",0]
[null,null,null,null,null,null,1519,146,183,"TM 146","-","TM 183",2,":",5]
[null,null,null,null,null,null,1520,180,47,"TM 180","-","TM 47",1,":",3]
[null,null,null,null,null,null,1521,153,8,"TM 153","-","RB Leipzig",3,":",0]
[null,null,null,null,null,null,1522,110,42,"TM 110","-","TM 42",2,":",9]
[null,null,null,null,null,null,1523,43,89,"TM 43","-","TM 89",1,":",3]
[null,null,null,null,null,null,1524,7,177,"Borussia Dortmund","-","TM 177",3,":",1]
[null,null,null,null,null,null,1525,150,87,"TM 150","-","TM 87",0,":",2]
[null,null,null,null,null,null,1526,176,140,"TM 176","-","TM 140",0,":",0]
[null,null,null,null,null,null,1527,126,91,"TM 126","-","TM 91",0,":",3]
[null,null,null,null,null,null,1528,86,38,"TM 86","-","FC Basel",0,":",0]
[null,null,null,null,null,null,1529,78,85,"TM 78","-","TM 85",0,":",1]
[null,null,null,null,null,null,1530,83,71,"TM 83","-","TM 71",3,":",0]
[null,null,null,null,null,null,1531,45,175,"TM 45","-","TM 175",1,":",5]
[null,null,null,null,null,null,1532,174,199,"TM 174","-","TM 199",4,":",0]
[null,null,null,null,null,null,1533,95,10,"TM 95","-","Bayer Leverkusen",2,":",5]
[null,null,null,null,null,null,1534,19,166,"Feyenoord Rotterdam","-","TM 166",3,":",1]
[null,null,null,null,null,null,1535,165,77,"TM 165","-","TM 77",0,":",3]
[null,null,null,null,null,null,1536,6,73,"Inter Mailand","-","TM 73",9,":",2]
[null,null,null,null,null,null,1537,27,104,"Young Boys Bern","-","TM 104",3,":",1]
[null,null,null,null,null,null,1538,134,168,{"$f":"IFERROR(VLOOKUP($H1543,$B$6:$C$205,2,0),\"\")","v":"TM 134"},"-",{"$f":"IFERROR(VLOOKUP($I1543,$B$6:$C$205,2,0),\"\")","v":"TM 168"},1,":",3]
[null,null,null,null,null,null,1539,24,145,"Red Bull Salzburg","-","TM 145",2,":",0]
[null,null,null,null,null,null,1540,75,157,"TM 75","-","TM 157",0,":",0]
[null,null,null,null,null,null,1541,39,158,"FC Lille","-","TM 158",3,":",0]
[null,null,null,null,null,null,1542,132,192,"TM 132","-","TM 192",0,":",0]
[null,null,null,null,null,null,1543,34,4,"Stade Brest","-","Paris Saint-Germain",1,":",0]
[null,null,null,null,null,null,1544,29,129,"Aston Villa","-","TM 129",0,":",3]
[null,null,null,null,null,null,1545,162,72,"TM 162","-","TM 72",5,":",1]
[null,null,null,null,null,null,1546,144,147,"TM 144","-","TM 147",0,":",4]
[null,null,null,null,null,null,1547,36,156,"Mainz 05","-","TM 156",5,":",2]
[null,null,null,null,null,null,1548,173,182,"TM 173","-","TM 182",3,":",1]
[null,null,null,null,null,null,1549,84,102,"TM 84","-","TM 102",0,":",3]
[null,null,null,null,null,null,1550,181,194,"TM 181","-","TM 194",9,":",2]
[null,null,null,null,null,null,1551,99,3,"TM 99","-","FC Bayern München",2,":",1]
[null,null,null,null,null,null,1552,142,16,"TM 142","-","FC Brügge",1,":",3]
[null,null,null,null,null,null,1553,163,103,"TM 163","-","TM 103",2,":",0]
[null,null,null,null,null,null,1554,70,74,"TM 70","-","TM 74",0,":",0]
[null,null,null,null,null,null,1555,178,172,"TM 178","-","TM 172",3,":",0]
[null,null,null,null,null,null,1556,155,81,"TM 155","-","TM 81",0,":",0]
[null,null,null,null,null,null,1557,108,69,"TM 108","-","TM 69",1,":",0]
[null,null,null,null,null,null,1558,28,57,"AS Monaco","-","TM 57",0,":",3]
[null,null,null,null,null,null,1559,14,170,"Benfica Lissabon","-","TM 170",5,":",1]
[null,null,null,null,null,null,1560,152,68,"TM 152","-","TM 68",0,":",4]
[null,null,null,null,null,null,1561,118,141,"TM 118","-","TM 141",5,":",2]
[null,null,null,null,null,null,1562,167,171,"TM 167","-","TM 171",3,":",1]
[null,null,null,null,null,null,1563,88,61,"TM 88","-","TM 61",0,":",3]
[null,null,null,null,null,null,1564,114,44,"TM 114","-","TM 44",9,":",2]
[null,null,null,null,null,null,1565,48,80,"TM 48","-","TM 80",3,":",1]
[null,null,null,null,null,null,1566,135,63,"TM 135","-","TM 63",1,":",3]
[null,null,null,null,null,null,1567,25,37,"OSC Lille","-","AC Roma",2,":",0]
[null,null,null,null,null,null,1568,169,49,"TM 169","-","TM 49",0,":",0]
[null,null,null,null,null,null,1569,40,82,"Hertha BSC","-","TM 82",3,":",0]
[null,null,null,null,null,null,1570,101,113,"TM 101","-","TM 113",0,":",0]
[null,null,null,null,null,null,1571,46,123,"TM 46","-","TM 123",1,":",0]
[null,null,null,null,null,null,1572,179,133,"TM 179","-","TM 133",0,":",3]
[null,null,null,null,null,null,1573,5,56,"FC Liverpool","-","TM 56",5,":",1]
[null,null,null,null,null,null,1574,121,2,"TM 121","-","Manchester City",0,":",4]
[null,null,null,null,null,null,1575,66,105,"TM 66","-","TM 105",5,":",2]
[null,null,null,null,null,null,1576,136,51,"TM 136","-","TM 51",1,":",3]
[null,null,null,null,null,null,1577,151,198,"TM 151","-","TM 198",3,":",1]
[null,null,null,null,null,null,1578,15,127,"FC Arsenal","-","TM 127",0,":",2]
[null,null,null,null,null,null,1579,64,131,"TM 64","-","TM 131",0,":",0]
[null,null,null,null,null,null,1580,60,195,"TM 60","-","TM 195",0,":",3]
[null,null,null,null,null,null,1581,154,62,"TM 154","-","TM 62",0,":",0]
[null,null,null,null,null,null,1582,55,65,"TM 55","-","TM 65",0,":",1]
[null,null,null,null,null,null,1583,67,122,"TM 67","-","TM 122",3,":",0]
[null,null,null,null,null,null,1584,100,196,"TM 100","-","TM 196",1,":",5]
[null,null,null,null,null,null,1585,193,164,"TM 193","-","TM 164",4,":",0]
[null,null,null,null,null,null,1586,54,90,"TM 54","-","TM 90",2,":",5]
[null,null,null,null,null,null,1587,9,76,"FC Barcelona","-","TM 76",1,":",3]
[null,null,null,null,null,null,1588,125,149,"TM 125","-","TM 149",3,":",0]
[null,null,null,null,null,null,1589,26,59,"Roter Stern Belgrad","-","TM 59",2,":",9]
[null,null,null,null,null,null,1590,92,143,"TM 92","-","TM 143",1,":",3]
[null,null,null,null,null,null,1591,41,189,"TM 41","-","TM 189",3,":",1]
[null,null,null,null,null,null,1592,130,128,"TM 130","-","TM 128",0,":",2]
[null,null,null,null,null,null,1593,119,197,"TM 119","-","TM 197",null,":"]
[null,null,null,null,null,null,1594,53,50,"TM 53","-","TM 50",null,":"]
[null,null,null,null,null,null,1595,79,52,"TM 79","-","TM 52",null,":"]
[null,null,null,null,null,null,1596,111,96,"TM 111","-","TM 96",null,":"]
[null,null,null,null,null,null,1597,22,13,"Celtic Glasgow","-","Juventus Turin",null,":"]
[null,null,null,null,null,null,1598,112,139,"TM 112","-","TM 139",null,":"]
[null,null,null,null,null,null,1599,200,58,"TM 200","-","TM 58",null,":"]
[null,null,null,null,null,null,1600,1,124,"Real Madrid","-","TM 124",null,":"]
[null,null,null,null,null,null,1601,137,107,"TM 137","-","TM 107",null,":"]
[null,null,null,null,null,null,1602,12,109,{"$f":"IFERROR(VLOOKUP($H1607,$B$6:$C$205,2,0),\"\")","v":"Atalanta Bergamo"},"-",{"$f":"IFERROR(VLOOKUP($I1607,$B$6:$C$205,2,0),\"\")","v":"TM 109"},null,":"]
[null,null,null,null,null,null,1603,20,187,"Sporting Lissabon","-","TM 187",null,":"]
[null,null,null,null,null,null,1604,186,115,"TM 186","-","TM 115",null,":"]
[null,null,null,null,null,null,1605,116,98,"TM 116","-","TM 98",null,":"]
[null,null,null,null,null,null,1606,185,188,"TM 185","-","TM 188",null,":"]
[null,null,null,null,null,null,1607,190,97,"TM 190","-","TM 97",null,":"]
[null,null,null,null,null,null,1608,120,191,"TM 120","-","TM 191",null,":"]
[null,null,null,null,null,null,1609,117,11,"TM 117","-","Atletico Madrid",null,":"]
[null,null,null,null,null,null,1610,184,17,"TM 184","-","Schachtjor Donezk",null,":"]
[null,null,null,null,null,null,1611,18,93,"AC Mailand","-","TM 93",null,":"]
[null,null,null,null,null,null,1612,94,21,"TM 94","-","PSV Eindhoven",null,":"]
[null,null,null,null,null,null,1613,23,30,"Dinamo Zagreb","-","FC Bologna",null,":"]
[null,null,null,null,null,null,1614,160,31,"TM 160","-","FC Girona",null,":"]
[null,null,null,null,null,null,1615,32,106,"VfB Stuttgart","-","TM 106",null,":"]
[null,null,null,null,null,null,1616,159,33,"TM 159","-","Sturm Graz",null,":"]
[null,null,null,null,null,null,1617,35,148,"Eintracht Frankfurt","-","TM 148",null,":"]
[null,null,null,null,null,null,1618,183,161,"TM 183","-","TM 161",null,":"]
[null,null,null,null,null,null,1619,138,180,"TM 138","-","TM 180",null,":"]
[null,null,null,null,null,null,1620,8,146,"RB Leipzig","-","TM 146",null,":"]
[null,null,null,null,null,null,1621,47,110,"TM 47","-","TM 110",null,":"]
[null,null,null,null,null,null,1622,89,153,"TM 89","-","TM 153",null,":"]
[null,null,null,null,null,null,1623,42,7,"TM 42","-","Borussia Dortmund",null,":"]
[null,null,null,null,null,null,1624,87,43,"TM 87","-","TM 43",null,":"]
[null,null,null,null,null,null,1625,177,176,"TM 177","-","TM 176",null,":"]
[null,null,null,null,null,null,1626,91,150,"TM 91","-","TM 150",null,":"]
[null,null,null,null,null,null,1627,140,86,"TM 140","-","TM 86",null,":"]
[null,null,null,null,null,null,1628,85,126,"TM 85","-","TM 126",null,":"]
[null,null,null,null,null,null,1629,38,83,"FC Basel","-","TM 83",null,":"]
[null,null,null,null,null,null,1630,175,78,"TM 175","-","TM 78",null,":"]
[null,null,null,null,null,null,1631,71,174,"TM 71","-","TM 174",null,":"]
[null,null,null,null,null,null,1632,10,45,"Bayer Leverkusen","-","TM 45",null,":"]
[null,null,null,null,null,null,1633,199,19,"TM 199","-","Feyenoord Rotterdam",null,":"]
[null,null,null,null,null,null,1634,77,95,"TM 77","-","TM 95",null,":"]
[null,null,null,null,null,null,1635,166,6,"TM 166","-","Inter Mailand",null,":"]
[null,null,null,null,null,null,1636,104,165,"TM 104","-","TM 165",null,":"]
[null,null,null,null,null,null,1637,73,134,"TM 73","-","TM 134",null,":"]
[null,null,null,null,null,null,1638,145,27,"TM 145","-","Young Boys Bern",null,":"]
[null,null,null,null,null,null,1639,168,75,"TM 168","-","TM 75",null,":"]
[null,null,null,null,null,null,1640,158,24,"TM 158","-","Red Bull Salzburg",null,":"]
[null,null,null,null,null,null,1641,157,132,"TM 157","-","TM 132",null,":"]
[null,null,null,null,null,null,1642,4,39,"Paris Saint-Germain","-","FC Lille",null,":"]
[null,null,null,null,null,null,1643,192,29,"TM 192","-","Aston Villa",null,":"]
[null,null,null,null,null,null,1644,72,34,"TM 72","-","Stade Brest",null,":"]
[null,null,null,null,null,null,1645,129,144,"TM 129","-","TM 144",null,":"]
[null,null,null,null,null,null,1646,156,162,"TM 156","-","TM 162",null,":"]
[null,null,null,null,null,null,1647,147,173,"TM 147","-","TM 173",null,":"]
[null,null,null,null,null,null,1648,102,36,"TM 102","-","Mainz 05",null,":"]
[null,null,null,null,null,null,1649,182,181,"TM 182","-","TM 181",null,":"]
[null,null,null,null,null,null,1650,3,84,"FC Bayern München","-","TM 84",null,":"]
[null,null,null,null,null,null,1651,194,142,"TM 194","-","TM 142",null,":"]
[null,null,null,null,null,null,1652,103,99,"TM 103","-","TM 99",null,":"]
[null,null,null,null,null,null,1653,16,70,"FC Brügge","-","TM 70",null,":"]
[null,null,null,null,null,null,1654,172,163,"TM 172","-","TM 163",null,":"]
[null,null,null,null,null,null,1655,74,155,"TM 74","-","TM 155",null,":"]
[null,null,null,null,null,null,1656,69,178,"TM 69","-","TM 178",null,":"]
[null,null,null,null,null,null,1657,81,28,"TM 81","-","AS Monaco",null,":"]
[null,null,null,null,null,null,1658,170,108,"TM 170","-","TM 108",null,":"]
[null,null,null,null,null,null,1659,57,152,"TM 57","-","TM 152",null,":"]
[null,null,null,null,null,null,1660,141,14,"TM 141","-","Benfica Lissabon",null,":"]
[null,null,null,null,null,null,1661,68,167,"TM 68","-","TM 167",null,":"]
[null,null,null,null,null,null,1662,61,118,"TM 61","-","TM 118",null,":"]
[null,null,null,null,null,null,1663,171,114,"TM 171","-","TM 114",null,":"]
[null,null,null,null,null,null,1664,80,88,"TM 80","-","TM 88",null,":"]
[null,null,null,null,null,null,1665,44,135,"TM 44","-","TM 135",null,":"]
[null,null,null,null,null,null,1666,37,48,{"$f":"IFERROR(VLOOKUP($H1671,$B$6:$C$205,2,0),\"\")","v":"AC Roma"},"-",{"$f":"IFERROR(VLOOKUP($I1671,$B$6:$C$205,2,0),\"\")","v":"TM 48"},null,":"]
[null,null,null,null,null,null,1667,63,169,"TM 63","-","TM 169",null,":"]
[null,null,null,null,null,null,1668,82,25,"TM 82","-","OSC Lille",null,":"]
[null,null,null,null,null,null,1669,49,101,"TM 49","-","TM 101",null,":"]
[null,null,null,null,null,null,1670,123,40,"TM 123","-","Hertha BSC",null,":"]
[null,null,null,null,null,null,1671,113,179,"TM 113","-","TM 179",null,":"]
[null,null,null,null,null,null,1672,56,46,"TM 56","-","TM 46",null,":"]
[null,null,null,null,null,null,1673,133,121,"TM 133","-","TM 121",null,":"]
[null,null,null,null,null,null,1674,105,5,"TM 105","-","FC Liverpool",null,":"]
[null,null,null,null,null,null,1675,2,136,"Manchester City","-","TM 136",null,":"]
[null,null,null,null,null,null,1676,198,66,"TM 198","-","TM 66",null,":"]
[null,null,null,null,null,null,1677,51,15,"TM 51","-","FC Arsenal",null,":"]
[null,null,null,null,null,null,1678,131,151,"TM 131","-","TM 151",null,":"]
[null,null,null,null,null,null,1679,127,60,"TM 127","-","TM 60",null,":"]
[null,null,null,null,null,null,1680,62,64,"TM 62","-","TM 64",null,":"]
[null,null,null,null,null,null,1681,195,55,"TM 195","-","TM 55",null,":"]
[null,null,null,null,null,null,1682,122,154,"TM 122","-","TM 154",null,":"]
[null,null,null,null,null,null,1683,65,100,"TM 65","-","TM 100",null,":"]
[null,null,null,null,null,null,1684,164,67,"TM 164","-","TM 67",null,":"]
[null,null,null,null,null,null,1685,196,54,"TM 196","-","TM 54",null,":"]
[null,null,null,null,null,null,1686,76,193,"TM 76","-","TM 193",null,":"]
[null,null,null,null,null,null,1687,90,125,"TM 90","-","TM 125",null,":"]
[null,null,null,null,null,null,1688,59,9,"TM 59","-","FC Barcelona",null,":"]
[null,null,null,null,null,null,1689,149,92,"TM 149","-","TM 92",null,":"]
[null,null,null,null,null,null,1690,189,26,"TM 189","-","Roter Stern Belgrad",null,":"]
[null,null,null,null,null,null,1691,143,130,"TM 143","-","TM 130",null,":"]
[null,null,null,null,null,null,1692,197,41,"TM 197","-","TM 41",null,":"]
[null,null,null,null,null,null,1693,128,53,"TM 128","-","TM 53",null,":"]
[null,null,null,null,null,null,1694,52,119,"TM 52","-","TM 119",null,":"]
[null,null,null,null,null,null,1695,50,111,"TM 50","-","TM 111",null,":"]
[null,null,null,null,null,null,1696,13,79,"Juventus Turin","-","TM 79",null,":"]
[null,null,null,null,null,null,1697,96,112,"TM 96","-","TM 112",null,":"]
[null,null,null,null,null,null,1698,58,22,"TM 58","-","Celtic Glasgow",null,":"]
[null,null,null,null,null,null,1699,139,1,"TM 139","-","Real Madrid",null,":"]
[null,null,null,null,null,null,1700,124,200,"TM 124","-","TM 200",null,":"]
[null,null,null,null,null,null,1701,12,137,"Atalanta Bergamo","-","TM 137",null,":"]
[null,null,null,null,null,null,1702,187,107,"TM 187","-","TM 107",null,":"]
[null,null,null,null,null,null,1703,109,186,"TM 109","-","TM 186",null,":"]
[null,null,null,null,null,null,1704,98,20,"TM 98","-","Sporting Lissabon",null,":"]
[null,null,null,null,null,null,1705,115,185,"TM 115","-","TM 185",null,":"]
[null,null,null,null,null,null,1706,97,116,"TM 97","-","TM 116",null,":"]
[null,null,null,null,null,null,1707,188,120,"TM 188","-","TM 120",null,":"]
[null,null,null,null,null,null,1708,11,190,"Atletico Madrid","-","TM 190",null,":"]
[null,null,null,null,null,null,1709,191,184,"TM 191","-","TM 184",null,":"]
[null,null,null,null,null,null,1710,93,117,"TM 93","-","TM 117",null,":"]
[null,null,null,null,null,null,1711,17,94,"Schachtjor Donezk","-","TM 94",null,":"]
[null,null,null,null,null,null,1712,30,18,"FC Bologna","-","AC Mailand",null,":"]
[null,null,null,null,null,null,1713,21,160,"PSV Eindhoven","-","TM 160",null,":"]
[null,null,null,null,null,null,1714,106,23,"TM 106","-","Dinamo Zagreb",null,":"]
[null,null,null,null,null,null,1715,31,159,"FC Girona","-","TM 159",null,":"]
[null,null,null,null,null,null,1716,148,32,"TM 148","-","VfB Stuttgart",null,":"]
[null,null,null,null,null,null,1717,33,183,"Sturm Graz","-","TM 183",null,":"]
[null,null,null,null,null,null,1718,180,35,"TM 180","-","Eintracht Frankfurt",null,":"]
[null,null,null,null,null,null,1719,161,8,"TM 161","-","RB Leipzig",null,":"]
[null,null,null,null,null,null,1720,110,138,"TM 110","-","TM 138",null,":"]
[null,null,null,null,null,null,1721,146,89,"TM 146","-","TM 89",null,":"]
[null,null,null,null,null,null,1722,7,47,"Borussia Dortmund","-","TM 47",null,":"]
[null,null,null,null,null,null,1723,153,87,"TM 153","-","TM 87",null,":"]
[null,null,null,null,null,null,1724,176,42,"TM 176","-","TM 42",null,":"]
[null,null,null,null,null,null,1725,43,91,"TM 43","-","TM 91",null,":"]
[null,null,null,null,null,null,1726,86,177,"TM 86","-","TM 177",null,":"]
[null,null,null,null,null,null,1727,150,85,"TM 150","-","TM 85",null,":"]
[null,null,null,null,null,null,1728,83,140,"TM 83","-","TM 140",null,":"]
[null,null,null,null,null,null,1729,126,175,"TM 126","-","TM 175",null,":"]
[null,null,null,null,null,null,1730,174,38,{"$f":"IFERROR(VLOOKUP($H1735,$B$6:$C$205,2,0),\"\")","v":"TM 174"},"-",{"$f":"IFERROR(VLOOKUP($I1735,$B$6:$C$205,2,0),\"\")","v":"FC Basel"},null,":"]
[null,null,null,null,null,null,1731,78,10,"TM 78","-","Bayer Leverkusen",null,":"]
[null,null,null,null,null,null,1732,19,71,"Feyenoord Rotterdam","-","TM 71",null,":"]
[null,null,null,null,null,null,1733,45,77,"TM 45","-","TM 77",null,":"]
[null,null,null,null,null,null,1734,6,199,"Inter Mailand","-","TM 199",null,":"]
[null,null,null,null,null,null,1735,95,104,"TM 95","-","TM 104",null,":"]
[null,null,null,null,null,null,1736,134,166,"TM 134","-","TM 166",null,":"]
[null,null,null,null,null,null,1737,165,145,"TM 165","-","TM 145",null,":"]
[null,null,null,null,null,null,1738,75,73,"TM 75","-","TM 73",null,":"]
[null,null,null,null,null,null,1739,27,158,"Young Boys Bern","-","TM 158",null,":"]
[null,null,null,null,null,null,1740,132,168,"TM 132","-","TM 168",null,":"]
[null,null,null,null,null,null,1741,24,4,"Red Bull Salzburg","-","Paris Saint-Germain",null,":"]
[null,null,null,null,null,null,1742,29,157,"Aston Villa","-","TM 157",null,":"]
[null,null,null,null,null,null,1743,39,72,"FC Lille","-","TM 72",null,":"]
[null,null,null,null,null,null,1744,144,192,"TM 144","-","TM 192",null,":"]
[null,null,null,null,null,null,1745,34,156,"Stade Brest","-","TM 156",null,":"]
[null,null,null,null,null,null,1746,173,129,"TM 173","-","TM 129",null,":"]
[null,null,null,null,null,null,1747,162,102,"TM 162","-","TM 102",null,":"]
[null,null,null,null,null,null,1748,181,147,"TM 181","-","TM 147",null,":"]
[null,null,null,null,null,null,1749,36,3,"Mainz 05","-","FC Bayern München",null,":"]
[null,null,null,null,null,null,1750,142,182,"TM 142","-","TM 182",null,":"]
[null,null,null,null,null,null,1751,84,103,"TM 84","-","TM 103",null,":"]
[null,null,null,null,null,null,1752,70,194,"TM 70","-","TM 194",null,":"]
[null,null,null,null,null,null,1753,99,172,"TM 99","-","TM 172",null,":"]
[null,null,null,null,null,null,1754,155,16,"TM 155","-","FC Brügge",null,":"]
[null,null,null,null,null,null,1755,163,69,"TM 163","-","TM 69",null,":"]
[null,null,null,null,null,null,1756,28,74,"AS Monaco","-","TM 74",null,":"]
[null,null,null,null,null,null,1757,178,170,"TM 178","-","TM 170",null,":"]
[null,null,null,null,null,null,1758,152,81,"TM 152","-","TM 81",null,":"]
[null,null,null,null,null,null,1759,108,141,"TM 108","-","TM 141",null,":"]
[null,null,null,null,null,null,1760,167,57,"TM 167","-","TM 57",null,":"]
[null,null,null,null,null,null,1761,14,61,"Benfica Lissabon","-","TM 61",null,":"]
[null,null,null,null,null,null,1762,114,68,"TM 114","-","TM 68",null,":"]
[null,null,null,null,null,null,1763,118,80,"TM 118","-","TM 80",null,":"]
[null,null,null,null,null,null,1764,135,171,"TM 135","-","TM 171",null,":"]
[null,null,null,null,null,null,1765,88,37,"TM 88","-","AC Roma",null,":"]
[null,null,null,null,null,null,1766,169,44,"TM 169","-","TM 44",null,":"]
[null,null,null,null,null,null,1767,48,82,"TM 48","-","TM 82",null,":"]
[null,null,null,null,null,null,1768,101,63,"TM 101","-","TM 63",null,":"]
[null,null,null,null,null,null,1769,25,123,"OSC Lille","-","TM 123",null,":"]
[null,null,null,null,null,null,1770,179,49,"TM 179","-","TM 49",null,":"]
[null,null,null,null,null,null,1771,40,56,"Hertha BSC","-","TM 56",null,":"]
[null,null,null,null,null,null,1772,121,113,"TM 121","-","TM 113",null,":"]
[null,null,null,null,null,null,1773,46,105,"TM 46","-","TM 105",null,":"]
[null,null,null,null,null,null,1774,136,133,"TM 136","-","TM 133",null,":"]
[null,null,null,null,null,null,1775,5,198,"FC Liverpool","-","TM 198",null,":"]
[null,null,null,null,null,null,1776,15,2,"FC Arsenal","-","Manchester City",null,":"]
[null,null,null,null,null,null,1777,66,131,"TM 66","-","TM 131",null,":"]
[null,null,null,null,null,null,1778,60,51,"TM 60","-","TM 51",null,":"]
[null,null,null,null,null,null,1779,151,62,"TM 151","-","TM 62",null,":"]
[null,null,null,null,null,null,1780,55,127,"TM 55","-","TM 127",null,":"]
[null,null,null,null,null,null,1781,64,122,"TM 64","-","TM 122",null,":"]
[null,null,null,null,null,null,1782,100,195,"TM 100","-","TM 195",null,":"]
[null,null,null,null,null,null,1783,154,164,"TM 154","-","TM 164",null,":"]
[null,null,null,null,null,null,1784,54,65,"TM 54","-","TM 65",null,":"]
[null,null,null,null,null,null,1785,67,76,"TM 67","-","TM 76",null,":"]
[null,null,null,null,null,null,1786,125,196,"TM 125","-","TM 196",null,":"]
[null,null,null,null,null,null,1787,193,59,"TM 193","-","TM 59",null,":"]
[null,null,null,null,null,null,1788,92,90,"TM 92","-","TM 90",null,":"]
[null,null,null,null,null,null,1789,9,189,"FC Barcelona","-","TM 189",null,":"]
[null,null,null,null,null,null,1790,130,149,"TM 130","-","TM 149",null,":"]
[null,null,null,null,null,null,1791,26,197,"Roter Stern Belgrad","-","TM 197",null,":"]
[null,null,null,null,null,null,1792,53,143,"TM 53","-","TM 143",null,":"]
[null,null,null,null,null,null,1793,41,52,"TM 41","-","TM 52",null,":"]
[null,null,null,null,null,null,1794,111,128,{"$f":"IFERROR(VLOOKUP($H1799,$B$6:$C$205,2,0),\"\")","v":"TM 111"},"-",{"$f":"IFERROR(VLOOKUP($I1799,$B$6:$C$205,2,0),\"\")","v":"TM 128"},null,":"]
[null,null,null,null,null,null,1795,119,13,"TM 119","-","Juventus Turin",null,":"]
[null,null,null,null,null,null,1796,112,50,"TM 112","-","TM 50",null,":"]
[null,null,null,null,null,null,1797,79,58,"TM 79","-","TM 58",null,":"]
[null,null,null,null,null,null,1798,1,96,"Real Madrid","-","TM 96",null,":"]
[null,null,null,null,null,null,1799,22,124,"Celtic Glasgow","-","TM 124",null,":"]
[null,null,null,null,null,null,1800,200,139,"TM 200","-","TM 139",null,":"]
[null,null,null,null,null,null,1801,137,187,"TM 137","-","TM 187",null,":"]
[null,null,null,null,null,null,1802,186,12,"TM 186","-","Atalanta Bergamo",null,":"]
[null,null,null,null,null,null,1803,107,98,"TM 107","-","TM 98",null,":"]
[null,null,null,null,null,null,1804,185,109,"TM 185","-","TM 109",null,":"]
[null,null,null,null,null,null,1805,20,97,"Sporting Lissabon","-","TM 97",null,":"]
[null,null,null,null,null,null,1806,120,115,"TM 120","-","TM 115",null,":"]
[null,null,null,null,null,null,1807,116,11,"TM 116","-","Atletico Madrid",null,":"]
[null,null,null,null,null,null,1808,184,188,"TM 184","-","TM 188",null,":"]
[null,null,null,null,null,null,1809,190,93,"TM 190","-","TM 93",null,":"]
[null,null,null,null,null,null,1810,94,191,"TM 94","-","TM 191",null,":"]
[null,null,null,null,null,null,1811,117,30,"TM 117","-","FC Bologna",null,":"]
[null,null,null,null,null,null,1812,160,17,"TM 160","-","Schachtjor Donezk",null,":"]
[null,null,null,null,null,null,1813,18,106,"AC Mailand","-","TM 106",null,":"]
[null,null,null,null,null,null,1814,159,21,"TM 159","-","PSV Eindhoven",null,":"]
[null,null,null,null,null,null,1815,23,148,"Dinamo Zagreb","-","TM 148",null,":"]
[null,null,null,null,null,null,1816,183,31,"TM 183","-","FC Girona",null,":"]
[null,null,null,null,null,null,1817,32,180,"VfB Stuttgart","-","TM 180",null,":"]
[null,null,null,null,null,null,1818,8,33,"RB Leipzig","-","Sturm Graz",null,":"]
[null,null,null,null,null,null,1819,35,110,"Eintracht Frankfurt","-","TM 110",null,":"]
[null,null,null,null,null,null,1820,89,161,"TM 89","-","TM 161",null,":"]
[null,null,null,null,null,null,1821,138,7,"TM 138","-","Borussia Dortmund",null,":"]
[null,null,null,null,null,null,1822,87,146,"TM 87","-","TM 146",null,":"]
[null,null,null,null,null,null,1823,47,176,"TM 47","-","TM 176",null,":"]
[null,null,null,null,null,null,1824,91,153,"TM 91","-","TM 153",null,":"]
[null,null,null,null,null,null,1825,42,86,"TM 42","-","TM 86",null,":"]
[null,null,null,null,null,null,1826,85,43,"TM 85","-","TM 43",null,":"]
[null,null,null,null,null,null,1827,177,83,"TM 177","-","TM 83",null,":"]
[null,null,null,null,null,null,1828,175,150,"TM 175","-","TM 150",null,":"]
[null,null,null,null,null,null,1829,140,174,"TM 140","-","TM 174",null,":"]
[null,null,null,null,null,null,1830,10,126,"Bayer Leverkusen","-","TM 126",null,":"]
[null,null,null,null,null,null,1831,38,19,"FC Basel","-","Feyenoord Rotterdam",null,":"]
[null,null,null,null,null,null,1832,77,78,"TM 77","-","TM 78",null,":"]
[null,null,null,null,null,null,1833,71,6,"TM 71","-","Inter Mailand",null,":"]
[null,null,null,null,null,null,1834,104,45,"TM 104","-","TM 45",null,":"]
[null,null,null,null,null,null,1835,199,134,"TM 199","-","TM 134",null,":"]
[null,null,null,null,null,null,1836,145,95,"TM 145","-","TM 95",null,":"]
[null,null,null,null,null,null,1837,166,75,"TM 166","-","TM 75",null,":"]
[null,null,null,null,null,null,1838,158,165,"TM 158","-","TM 165",null,":"]
[null,null,null,null,null,null,1839,73,132,"TM 73","-","TM 132",null,":"]
[null,null,null,null,null,null,1840,4,27,"Paris Saint-Germain","-","Young Boys Bern",null,":"]
[null,null,null,null,null,null,1841,168,29,"TM 168","-","Aston Villa",null,":"]
[null,null,null,null,null,null,1842,72,24,"TM 72","-","Red Bull Salzburg",null,":"]
[null,null,null,null,null,null,1843,157,144,"TM 157","-","TM 144",null,":"]
[null,null,null,null,null,null,1844,156,39,"TM 156","-","FC Lille",null,":"]
[null,null,null,null,null,null,1845,192,173,"TM 192","-","TM 173",null,":"]
[null,null,null,null,null,null,1846,102,34,"TM 102","-","Stade Brest",null,":"]
[null,null,null,null,null,null,1847,129,181,"TM 129","-","TM 181",null,":"]
[null,null,null,null,null,null,1848,3,162,"FC Bayern München","-","TM 162",null,":"]
[null,null,null,null,null,null,1849,147,142,"TM 147","-","TM 142",null,":"]
[null,null,null,null,null,null,1850,103,36,"TM 103","-","Mainz 05",null,":"]
[null,null,null,null,null,null,1851,182,70,"TM 182","-","TM 70",null,":"]
[null,null,null,null,null,null,1852,172,84,"TM 172","-","TM 84",null,":"]
[null,null,null,null,null,null,1853,194,155,"TM 194","-","TM 155",null,":"]
[null,null,null,null,null,null,1854,69,99,"TM 69","-","TM 99",null,":"]
[null,null,null,null,null,null,1855,16,28,"FC Brügge","-","AS Monaco",null,":"]
[null,null,null,null,null,null,1856,170,163,"TM 170","-","TM 163",null,":"]
[null,null,null,null,null,null,1857,74,152,"TM 74","-","TM 152",null,":"]
[null,null,null,null,null,null,1858,141,178,{"$f":"IFERROR(VLOOKUP($H1863,$B$6:$C$205,2,0),\"\")","v":"TM 141"},"-",{"$f":"IFERROR(VLOOKUP($I1863,$B$6:$C$205,2,0),\"\")","v":"TM 178"},null,":"]
[null,null,null,null,null,null,1859,81,167,"TM 81","-","TM 167",null,":"]
[null,null,null,null,null,null,1860,61,108,"TM 61","-","TM 108",null,":"]
[null,null,null,null,null,null,1861,57,114,"TM 57","-","TM 114",null,":"]
[null,null,null,null,null,null,1862,80,14,"TM 80","-","Benfica Lissabon",null,":"]
[null,null,null,null,null,null,1863,68,135,"TM 68","-","TM 135",null,":"]
[null,null,null,null,null,null,1864,37,118,"AC Roma","-","TM 118",null,":"]
[null,null,null,null,null,null,1865,171,169,"TM 171","-","TM 169",null,":"]
[null,null,null,null,null,null,1866,82,88,"TM 82","-","TM 88",null,":"]
[null,null,null,null,null,null,1867,44,101,"TM 44","-","TM 101",null,":"]
[null,null,null,null,null,null,1868,123,48,"TM 123","-","TM 48",null,":"]
[null,null,null,null,null,null,1869,63,179,"TM 63","-","TM 179",null,":"]
[null,null,null,null,null,null,1870,56,25,"TM 56","-","OSC Lille",null,":"]
[null,null,null,null,null,null,1871,49,121,"TM 49","-","TM 121",null,":"]
[null,null,null,null,null,null,1872,105,40,"TM 105","-","Hertha BSC",null,":"]
[null,null,null,null,null,null,1873,113,136,"TM 113","-","TM 136",null,":"]
[null,null,null,null,null,null,1874,198,46,"TM 198","-","TM 46",null,":"]
[null,null,null,null,null,null,1875,133,15,"TM 133","-","FC Arsenal",null,":"]
[null,null,null,null,null,null,1876,131,5,"TM 131","-","FC Liverpool",null,":"]
[null,null,null,null,null,null,1877,2,60,"Manchester City","-","TM 60",null,":"]
[null,null,null,null,null,null,1878,62,66,"TM 62","-","TM 66",null,":"]
[null,null,null,null,null,null,1879,51,55,"TM 51","-","TM 55",null,":"]
[null,null,null,null,null,null,1880,122,151,"TM 122","-","TM 151",null,":"]
[null,null,null,null,null,null,1881,127,100,"TM 127","-","TM 100",null,":"]
[null,null,null,null,null,null,1882,164,64,"TM 164","-","TM 64",null,":"]
[null,null,null,null,null,null,1883,195,54,"TM 195","-","TM 54",null,":"]
[null,null,null,null,null,null,1884,76,154,"TM 76","-","TM 154",null,":"]
[null,null,null,null,null,null,1885,65,125,"TM 65","-","TM 125",null,":"]
[null,null,null,null,null,null,1886,59,67,"TM 59","-","TM 67",null,":"]
[null,null,null,null,null,null,1887,196,92,"TM 196","-","TM 92",null,":"]
[null,null,null,null,null,null,1888,189,193,"TM 189","-","TM 193",null,":"]
[null,null,null,null,null,null,1889,90,130,"TM 90","-","TM 130",null,":"]
[null,null,null,null,null,null,1890,197,9,"TM 197","-","FC Barcelona",null,":"]
[null,null,null,null,null,null,1891,149,53,"TM 149","-","TM 53",null,":"]
[null,null,null,null,null,null,1892,52,26,"TM 52","-","Roter Stern Belgrad",null,":"]
[null,null,null,null,null,null,1893,143,111,"TM 143","-","TM 111",null,":"]
[null,null,null,null,null,null,1894,13,41,"Juventus Turin","-","TM 41",null,":"]
[null,null,null,null,null,null,1895,128,112,"TM 128","-","TM 112",null,":"]
[null,null,null,null,null,null,1896,58,119,"TM 58","-","TM 119",null,":"]
[null,null,null,null,null,null,1897,50,1,"TM 50","-","Real Madrid",null,":"]
[null,null,null,null,null,null,1898,124,79,"TM 124","-","TM 79",null,":"]
[null,null,null,null,null,null,1899,96,200,"TM 96","-","TM 200",null,":"]
[null,null,null,null,null,null,1900,139,22,"TM 139","-","Celtic Glasgow",null,":"]
[null,null,null,null,null,null,1901,186,137,"TM 186","-","TM 137",null,":"]
[null,null,null,null,null,null,1902,98,187,"TM 98","-","TM 187",null,":"]
[null,null,null,null,null,null,1903,12,185,"Atalanta Bergamo","-","TM 185",null,":"]
[null,null,null,null,null,null,1904,97,107,"TM 97","-","TM 107",null,":"]
[null,null,null,null,null,null,1905,109,120,"TM 109","-","TM 120",null,":"]
[null,null,null,null,null,null,1906,11,20,"Atletico Madrid","-","Sporting Lissabon",null,":"]
[null,null,null,null,null,null,1907,115,184,"TM 115","-","TM 184",null,":"]
[null,null,null,null,null,null,1908,93,116,"TM 93","-","TM 116",null,":"]
[null,null,null,null,null,null,1909,188,94,"TM 188","-","TM 94",null,":"]
[null,null,null,null,null,null,1910,30,190,"FC Bologna","-","TM 190",null,":"]
[null,null,null,null,null,null,1911,191,160,"TM 191","-","TM 160",null,":"]
[null,null,null,null,null,null,1912,106,117,"TM 106","-","TM 117",null,":"]
[null,null,null,null,null,null,1913,17,159,"Schachtjor Donezk","-","TM 159",null,":"]
[null,null,null,null,null,null,1914,148,18,"TM 148","-","AC Mailand",null,":"]
[null,null,null,null,null,null,1915,21,183,"PSV Eindhoven","-","TM 183",null,":"]
[null,null,null,null,null,null,1916,180,23,"TM 180","-","Dinamo Zagreb",null,":"]
[null,null,null,null,null,null,1917,31,8,"FC Girona","-","RB Leipzig",null,":"]
[null,null,null,null,null,null,1918,110,32,"TM 110","-","VfB Stuttgart",null,":"]
[null,null,null,null,null,null,1919,33,89,"Sturm Graz","-","TM 89",null,":"]
[null,null,null,null,null,null,1920,7,35,"Borussia Dortmund","-","Eintracht Frankfurt",null,":"]
[null,null,null,null,null,null,1921,161,87,"TM 161","-","TM 87",null,":"]
[null,null,null,null,null,null,1922,176,138,{"$f":"IFERROR(VLOOKUP($H1927,$B$6:$C$205,2,0),\"\")","v":"TM 176"},"-",{"$f":"IFERROR(VLOOKUP($I1927,$B$6:$C$205,2,0),\"\")","v":"TM 138"},null,":"]
[null,null,null,null,null,null,1923,146,91,"TM 146","-","TM 91",null,":"]
[null,null,null,null,null,null,1924,86,47,"TM 86","-","TM 47",null,":"]
[null,null,null,null,null,null,1925,153,85,"TM 153","-","TM 85",null,":"]
[null,null,null,null,null,null,1926,83,42,"TM 83","-","TM 42",null,":"]
[null,null,null,null,null,null,1927,43,175,"TM 43","-","TM 175",null,":"]
[null,null,null,null,null,null,1928,174,177,"TM 174","-","TM 177",null,":"]
[null,null,null,null,null,null,1929,150,10,"TM 150","-","Bayer Leverkusen",null,":"]
[null,null,null,null,null,null,1930,19,140,"Feyenoord Rotterdam","-","TM 140",null,":"]
[null,null,null,null,null,null,1931,126,77,"TM 126","-","TM 77",null,":"]
[null,null,null,null,null,null,1932,6,38,"Inter Mailand","-","FC Basel",null,":"]
[null,null,null,null,null,null,1933,78,104,"TM 78","-","TM 104",null,":"]
[null,null,null,null,null,null,1934,134,71,"TM 134","-","TM 71",null,":"]
[null,null,null,null,null,null,1935,45,145,"TM 45","-","TM 145",null,":"]
[null,null,null,null,null,null,1936,75,199,"TM 75","-","TM 199",null,":"]
[null,null,null,null,null,null,1937,95,158,"TM 95","-","TM 158",null,":"]
[null,null,null,null,null,null,1938,132,166,"TM 132","-","TM 166",null,":"]
[null,null,null,null,null,null,1939,165,4,"TM 165","-","Paris Saint-Germain",null,":"]
[null,null,null,null,null,null,1940,29,73,"Aston Villa","-","TM 73",null,":"]
[null,null,null,null,null,null,1941,27,72,"Young Boys Bern","-","TM 72",null,":"]
[null,null,null,null,null,null,1942,144,168,"TM 144","-","TM 168",null,":"]
[null,null,null,null,null,null,1943,24,156,"Red Bull Salzburg","-","TM 156",null,":"]
[null,null,null,null,null,null,1944,173,157,"TM 173","-","TM 157",null,":"]
[null,null,null,null,null,null,1945,39,102,"FC Lille","-","TM 102",null,":"]
[null,null,null,null,null,null,1946,181,192,"TM 181","-","TM 192",null,":"]
[null,null,null,null,null,null,1947,34,3,"Stade Brest","-","FC Bayern München",null,":"]
[null,null,null,null,null,null,1948,142,129,"TM 142","-","TM 129",null,":"]
[null,null,null,null,null,null,1949,162,103,"TM 162","-","TM 103",null,":"]
[null,null,null,null,null,null,1950,70,147,"TM 70","-","TM 147",null,":"]
[null,null,null,null,null,null,1951,36,172,"Mainz 05","-","TM 172",null,":"]
[null,null,null,null,null,null,1952,155,182,"TM 155","-","TM 182",null,":"]
[null,null,null,null,null,null,1953,84,69,"TM 84","-","TM 69",null,":"]
[null,null,null,null,null,null,1954,28,194,"AS Monaco","-","TM 194",null,":"]
[null,null,null,null,null,null,1955,99,170,"TM 99","-","TM 170",null,":"]
[null,null,null,null,null,null,1956,152,16,"TM 152","-","FC Brügge",null,":"]
[null,null,null,null,null,null,1957,163,141,"TM 163","-","TM 141",null,":"]
[null,null,null,null,null,null,1958,167,74,"TM 167","-","TM 74",null,":"]
[null,null,null,null,null,null,1959,178,61,"TM 178","-","TM 61",null,":"]
[null,null,null,null,null,null,1960,114,81,"TM 114","-","TM 81",null,":"]
[null,null,null,null,null,null,1961,108,80,"TM 108","-","TM 80",null,":"]
[null,null,null,null,null,null,1962,135,57,"TM 135","-","TM 57",null,":"]
[null,null,null,null,null,null,1963,14,37,"Benfica Lissabon","-","AC Roma",null,":"]
[null,null,null,null,null,null,1964,169,68,"TM 169","-","TM 68",null,":"]
[null,null,null,null,null,null,1965,118,82,"TM 118","-","TM 82",null,":"]
[null,null,null,null,null,null,1966,101,171,"TM 101","-","TM 171",null,":"]
[null,null,null,null,null,null,1967,88,123,"TM 88","-","TM 123",null,":"]
[null,null,null,null,null,null,1968,179,44,"TM 179","-","TM 44",null,":"]
[null,null,null,null,null,null,1969,48,56,"TM 48","-","TM 56",null,":"]
[null,null,null,null,null,null,1970,121,63,"TM 121","-","TM 63",null,":"]
[null,null,null,null,null,null,1971,25,105,"OSC Lille","-","TM 105",null,":"]
[null,null,null,null,null,null,1972,136,49,"TM 136","-","TM 49",null,":"]
[null,null,null,null,null,null,1973,40,198,"Hertha BSC","-","TM 198",null,":"]
[null,null,null,null,null,null,1974,15,113,"FC Arsenal","-","TM 113",null,":"]
[null,null,null,null,null,null,1975,46,131,"TM 46","-","TM 131",null,":"]
[null,null,null,null,null,null,1976,60,133,"TM 60","-","TM 133",null,":"]
[null,null,null,null,null,null,1977,5,62,"FC Liverpool","-","TM 62",null,":"]
[null,null,null,null,null,null,1978,55,2,"TM 55","-","Manchester City",null,":"]
[null,null,null,null,null,null,1979,66,122,"TM 66","-","TM 122",null,":"]
[null,null,null,null,null,null,1980,100,51,"TM 100","-","TM 51",null,":"]
[null,null,null,null,null,null,1981,151,164,"TM 151","-","TM 164",null,":"]
[null,null,null,null,null,null,1982,54,127,"TM 54","-","TM 127",null,":"]
[null,null,null,null,null,null,1983,64,76,"TM 64","-","TM 76",null,":"]
[null,null,null,null,null,null,1984,125,195,"TM 125","-","TM 195",null,":"]
[null,null,null,null,null,null,1985,154,59,"TM 154","-","TM 59",null,":"]
[null,null,null,null,null,null,1986,92,65,{"$f":"IFERROR(VLOOKUP($H1991,$B$6:$C$205,2,0),\"\")","v":"TM 92"},"-",{"$f":"IFERROR(VLOOKUP($I1991,$B$6:$C$205,2,0),\"\")","v":"TM 65"},null,":"]
[null,null,null,null,null,null,1987,67,189,"TM 67","-","TM 189",null,":"]
[null,null,null,null,null,null,1988,130,196,"TM 130","-","TM 196",null,":"]
[null,null,null,null,null,null,1989,193,197,"TM 193","-","TM 197",null,":"]
[null,null,null,null,null,null,1990,53,90,"TM 53","-","TM 90",null,":"]
[null,null,null,null,null,null,1991,9,52,"FC Barcelona","-","TM 52",null,":"]
[null,null,null,null,null,null,1992,111,149,"TM 111","-","TM 149",null,":"]
[null,null,null,null,null,null,1993,26,13,"Roter Stern Belgrad","-","Juventus Turin",null,":"]
[null,null,null,null,null,null,1994,112,143,"TM 112","-","TM 143",null,":"]
[null,null,null,null,null,null,1995,41,58,"TM 41","-","TM 58",null,":"]
[null,null,null,null,null,null,1996,1,128,"Real Madrid","-","TM 128",null,":"]
[null,null,null,null,null,null,1997,119,124,"TM 119","-","TM 124",null,":"]
[null,null,null,null,null,null,1998,200,50,"TM 200","-","TM 50",null,":"]
[null,null,null,null,null,null,1999,79,139,"TM 79","-","TM 139",null,":"]
[null,null,null,null,null,null,2000,22,96,"Celtic Glasgow","-","TM 96",null,":"]